{"text_format":"1","workbook":"xlsx","n_sheets":14,"sheets":["Projekte","Jan","Feb","Mar","Apr","Mai","Jun","Jul","Aug","Sep","Okt","Nov","Dez","Hilfe"],"not_rendered":{"charts":0,"images":1,"macros":1,"external_links":1,"defined_names":353,"comments":0,"pivot_tables":0},"unopened":[],"bounds":{"document_bytes":16777216,"sheet_cells":100000,"rows_first":2000,"rows_last":500,"rows_between":2000,"halvings":0,"cell_chars":16384,"cell_head_chars":4096},"cells_cut":0,"cells_raw":0,"read":"whole","date_system":"1900"}

{"sheet":"Projekte","index":0,"n_rows":27,"n_cols":8,"rows_kept":27,"cut":false,"hidden":false,"merged":[]}
[null,null,"Projekt-Nummer\nTeilprojekt","ProjektName (Rückgabe)","Auwahl-\nFavorit","ab-geschl./\ngesperrt","Bemerkung","allgemein \nfür Jahr"]
[null,"Kostenstellen","kostenstelle?","Kostenstelle aus Plan heraussuchen"]
["persönlich","Privates","privat",{"$f":"A3&\" - \"&B3","v":"persönlich - Privates"},"x"]
["persönlich","Urlaub (Eintrag für pers. Protokoll)","Urlaub",{"$f":"A4&\" - \"&B4","v":"persönlich - Urlaub (Eintrag für pers. Protokoll)"},"x","x"]
["persönlich","Pausen (Mittag, Sport, …)","Pause",{"$f":"A5&\" - \"&B5","v":"persönlich - Pausen (Mittag, Sport, …)"},"x","x"]
["CT","?P20-0001/P17-0003 Allgemeine Vertriebsunterstützung","vertrieb_Allg_2017",{"$f":"IF(A6 <> \"\", A6&\" - \", \"\") & IF(B6 <> \"\", B6, \"\")","v":"CT - ?P20-0001/P17-0003 Allgemeine Vertriebsunterstützung"},"x",null,null,"2016.04ff"]
["CT","P17-0004 GS BI 5020 Vertriebsunterstützung   ","vertrieb_BI_2017","CT - P17-0004 GS BI 5020 Vertriebsunterstützung   ","x","x",null,"2016.04ff"]
["CT","P17-0005 GS S 5023 Vertriebsunterstützung","vertrieb_S_2017","CT - P17-0005 GS S 5023 Vertriebsunterstützung","x","x",null,"2016.04ff"]
["CT","P17-0006 GS HH 5025 Vertriebsunterstützung","vertrieb_HH_2017","CT - P17-0006 GS HH 5025 Vertriebsunterstützung","x","x",null,"2016.04ff"]
["CT","P17-0007 GS L 5027 Vertriebsunterstützung","vertrieb_L_2017","CT - P17-0007 GS L 5027 Vertriebsunterstützung","x","x",null,"2016.04ff"]
["CT","P17-0008 GS M 5028 Vertriebsunterstützung","vertrieb_M_2017","CT - P17-0008 GS M 5028 Vertriebsunterstützung","x","x",null,"2016.04ff"]
["CT","P20-0001/P17-0001/P19-0131 interne Consulting Tätigkeiten","orga2017","CT - P20-0001/P17-0001/P19-0131 interne Consulting Tätigkeiten","x",null,null,"2016.04ff"]
["CT","P20-0001/P17-0001/P19-0131 Schulung & Know How Aufbau / Transfer","schulungIntern2017","CT - P20-0001/P17-0001/P19-0131 Schulung & Know How Aufbau / Transfer","x",null,null,"2016.04ff"]
["CT","P20-0003 ~ Onboarding neue Mitarbeiter","schulungOnboardingNeueMA",{"$f":"IF(A14 <> \"\", A14&\" - \", \"\") & IF(B14 <> \"\", B14, \"\")","v":"CT - P20-0003 ~ Onboarding neue Mitarbeiter"},"x"]
["CT","P20-0001/P17-0001/P19-0131 Teamkoordination & Vertretung Consulting Leitung","teamKoordination2017","CT - P20-0001/P17-0001/P19-0131 Teamkoordination & Vertretung Consulting Leitung","x",null,null,"2016.04ff"]
["CT","P20-0001/P17-0001/P19-0131 Teamkoordination & Vertretung Consulting Leitung","vertretung Team2017","CT - P20-0001/P17-0001/P19-0131 Teamkoordination & Vertretung Consulting Leitung","x","x",null,"2016.04ff"]
["CT","Ceyoniq Orga + Infrastruktur:\nGremienmitarbeit, Verbesserungsvorschläge, Workarounds | auf P20-0001/P17-0001/P19-0131 Schulung","ct-AGInterneKommunikation",{"$f":"IF(A17 <> \"\", A17&\" - \", \"\") & IF(B17 <> \"\", B17, \"\")","v":"CT - Ceyoniq Orga + Infrastruktur:\nGremienmitarbeit, Verbesserungsvorschläge, Workarounds | auf P20-0001/P17-0001/P19-0131 Schulung"},"x"]
["CT","Ceyoniq Orga + Infrastruktur:\nS4Hana Einführung | P20-0001 S4Hana Einführung","ct-SAP-Einführung",{"$f":"IF(A18 <> \"\", A18&\" - \", \"\") & IF(B18 <> \"\", B18, \"\")","v":"CT - Ceyoniq Orga + Infrastruktur:\nS4Hana Einführung | P20-0001 S4Hana Einführung"},"x"]
["CT","P17-0001 Unterstützung Produktentwicklung","devel2017","CT - P17-0001 Unterstützung Produktentwicklung","x","x",null,"2016.04ff"]
["CT","P20-0001/P17-0001/P19-0131 Unterstützung Produktentwicklung","ct-devel2017",{"$f":"IF(A20 <> \"\", A20&\" - \", \"\") & IF(B20 <> \"\", B20, \"\")","v":"CT - P20-0001/P17-0001/P19-0131 Unterstützung Produktentwicklung"},"x",null,"18.6.2018: neues Keyword: devel2017 -> ct-devel2017","2016.04ff"]
["CT","P20-0001/P17-0001/P19-0131 Unterstützung Support","support2017","CT - P20-0001/P17-0001/P19-0131 Unterstützung Support","x",null,null,"2016.04ff"]
["CT","P20-0001/P17-0001/P19-0131 Installation, Pflege + Vorbereitung Werkzeuge","install2017","CT - P20-0001/P17-0001/P19-0131 Installation, Pflege + Vorbereitung Werkzeuge","x",null,null,"2016.04ff"]
["CT","Template- & Projektentwicklung ?P20-0001/P17-0002","ct-template+Projektentwicklung",{"$f":"IF(A23 <> \"\", A23&\" - \", \"\") & IF(B23 <> \"\", B23, \"\")","v":"CT - Template- & Projektentwicklung ?P20-0001/P17-0002"},"x",null,null,"2016.04ff"]
["CT","Template- & Projektentwicklung P17-0002","template+Projektentwicklung","CT - Template- & Projektentwicklung P17-0002","x","x",null,"2016.04ff"]
[null,"Support-Calls","Support","immer im Call erfassen: alternativ \"service\""]
["Polizei / FTS","Ergänzung Betriebshandbuch P15-0160","BMA-UpdateBetriebshandbuch0815",{"$f":"IF(A26 <> \"\", A26&\" - \", \"\") & IF(B26 <> \"\", B26, \"\")","v":"Polizei / FTS - Ergänzung Betriebshandbuch P15-0160"},"x","x"]
["Polizei / FTS","Sicherstellung 2023:\nKonzept","BMA-BMA2023-Konzept",{"$f":"IF(A27 <> \"\", A27&\" - \", \"\") & IF(B27 <> \"\", B27, \"\")","v":"Polizei / FTS - Sicherstellung 2023:\nKonzept"},"x","x"]

{"sheet":"Jan","index":1,"n_rows":204,"n_cols":17,"rows_kept":204,"cut":false,"hidden":false,"merged":[[0,13,0,15],[2,0,2,2]]}
[null,null,"DL-Zeiten von",{"$f":"AssignedToCfg","v":{"$error":"#REF!"}},null,null,null,null,null,null,null,null,null,"Faktura nicht erfasst"]
["Datum","Beginn","Ende","h","h,xx","r: Reise, \nx: nicht berechnen","Summe","Dienstleistung","Reise","nicht berechnen",null,"Tätigkeit","Faktura erfasst","Dienstleistung","Reise","nicht berechnen","Projektname"]
[null,null,null,null,null,"Summe",{"$f":"SUM(G4:G203)","v":0},{"$f":"SUM(H4:H203)","v":0},{"$f":"SUM(I4:I203)","v":0},{"$f":"SUM(J4:J203)","v":0},null,"<- für diesen ProjektBereich",null,{"$f":"SUM(N4:N203)","v":0},{"$f":"SUM(O4:O203)","v":0},{"$f":"SUM(P4:P203)","v":0}]
[null,null,null,{"$f":"IF(C4=\"\", \"\", C4-B4)","v":""},{"$f":"IF(D4=\"\", \"\", (C4-B4)*24)","v":""},null,{"$f":"IF(K4 = selectThisProjekt,E4, \"\")","v":""},{"$f":"IF(F4 = \"\", G4, \"\")","v":""},{"$f":"IF(LOWER(F4) = \"r\",G4,\"\")","v":""},{"$f":"IF(AND(F4<>\"\", LOWER(F4) <> \"r\"),G4,\"\")","v":""},null,null,null,{"$f":"IF(M4<>\"\", \"\", IF(F4 = \"\", G4, \"\"))","v":""},{"$f":"IF(M4<>\"\", \"\", IF(LOWER(F4) = \"r\",G4,\"\"))","v":""},{"$f":"IF(M4<>\"\", \"\", IF(AND(F4<>\"\", LOWER(F4) <> \"r\"),G4,\"\"))","v":""},{"$f":"IF(K4=\"\", \"\", VLOOKUP(K4,Projekte!C:D,2,FALSE))","v":""}]
[null,null,null,"","",null,"",{"$f":"IF(F5 = \"\", G5, \"\")","v":""},{"$f":"IF(LOWER(F5) = \"r\",G5,\"\")","v":""},{"$f":"IF(AND(F5<>\"\", LOWER(F5) <> \"r\"),G5,\"\")","v":""},null,null,null,{"$f":"IF(M5<>\"\", \"\", IF(F5 = \"\", G5, \"\"))","v":""},{"$f":"IF(M5<>\"\", \"\", IF(LOWER(F5) = \"r\",G5,\"\"))","v":""},{"$f":"IF(M5<>\"\", \"\", IF(AND(F5<>\"\", LOWER(F5) <> \"r\"),G5,\"\"))","v":""},{"$f":"IF(K5=\"\", \"\", VLOOKUP(K5,Projekte!C:D,2,FALSE))","v":""}]
[null,null,null,"","",null,"","","","",null,null,null,{"$f":"IF(M6<>\"\", \"\", IF(F6 = \"\", G6, \"\"))","v":""},{"$f":"IF(M6<>\"\", \"\", IF(LOWER(F6) = \"r\",G6,\"\"))","v":""},{"$f":"IF(M6<>\"\", \"\", IF(AND(F6<>\"\", LOWER(F6) <> \"r\"),G6,\"\"))","v":""},{"$f":"IF(K6=\"\", \"\", VLOOKUP(K6,Projekte!C:D,2,FALSE))","v":""}]
[null,null,null,"","",null,"","","","",null,null,null,"","","",{"$f":"IF(K7=\"\", \"\", VLOOKUP(K7,Projekte!C:D,2,FALSE))","v":""}]
[null,null,null,"","",null,"","","","",null,null,null,"","","",{"$f":"IF(K8=\"\", \"\", VLOOKUP(K8,Projekte!C:D,2,FALSE))","v":""}]
[null,null,null,"","",null,"","","","",null,null,null,"","","",{"$f":"IF(K9=\"\", \"\", VLOOKUP(K9,Projekte!C:D,2,FALSE))","v":""}]
[null,null,null,"","",null,"","","","",null,null,null,"","","",{"$f":"IF(K10=\"\", \"\", VLOOKUP(K10,Projekte!C:D,2,FALSE))","v":""}]
[null,null,null,"","",null,"","","","",null,null,null,"","","",{"$f":"IF(K11=\"\", \"\", VLOOKUP(K11,Projekte!C:D,2,FALSE))","v":""}]
[null,null,null,"","",null,"","","","",null,null,null,"","","",{"$f":"IF(K12=\"\", \"\", VLOOKUP(K12,Projekte!C:D,2,FALSE))","v":""}]
[null,null,null,"","",null,"","","","",null,null,null,"","","",{"$f":"IF(K13=\"\", \"\", VLOOKUP(K13,Projekte!C:D,2,FALSE))","v":""}]
[null,null,null,"","",null,"","","","",null,null,null,"","","",{"$f":"IF(K14=\"\", \"\", VLOOKUP(K14,Projekte!C:D,2,FALSE))","v":""}]
[null,null,null,"","",null,"","","","",null,null,null,"","","",{"$f":"IF(K15=\"\", \"\", VLOOKUP(K15,Projekte!C:D,2,FALSE))","v":""}]
[null,null,null,"","",null,"","","","",null,null,null,"","","",{"$f":"IF(K16=\"\", \"\", VLOOKUP(K16,Projekte!C:D,2,FALSE))","v":""}]
[null,null,null,"","",null,"","","","",null,null,null,"","","",{"$f":"IF(K17=\"\", \"\", VLOOKUP(K17,Projekte!C:D,2,FALSE))","v":""}]
[null,null,null,{"$f":"IF(C18=\"\", \"\", C18-B18)","v":""},{"$f":"IF(D18=\"\", \"\", (C18-B18)*24)","v":""},null,"","","","",null,null,null,"","","",{"$f":"IF(K18=\"\", \"\", VLOOKUP(K18,Projekte!C:D,2,FALSE))","v":""}]
[null,null,null,"","",null,"","","","",null,null,null,"","","",{"$f":"IF(K19=\"\", \"\", VLOOKUP(K19,Projekte!C:D,2,FALSE))","v":""}]
[null,null,null,"","",null,"","","","",null,null,null,"","","",{"$f":"IF(K20=\"\", \"\", VLOOKUP(K20,Projekte!C:D,2,FALSE))","v":""}]
[null,null,null,"","",null,"","","","",null,null,null,"","","",{"$f":"IF(K21=\"\", \"\", VLOOKUP(K21,Projekte!C:D,2,FALSE))","v":""}]
[null,null,null,"","",null,{"$f":"IF(K22 = selectThisProjekt,E22, \"\")","v":""},"","","",null,null,null,"","","",{"$f":"IF(K22=\"\", \"\", VLOOKUP(K22,Projekte!C:D,2,FALSE))","v":""}]
[null,null,null,"","",null,{"$f":"IF(K23 = selectThisProjekt,E23, \"\")","v":""},"","","",null,null,null,"","","",{"$f":"IF(K23=\"\", \"\", VLOOKUP(K23,Projekte!C:D,2,FALSE))","v":""}]
[null,null,null,"","",null,"","","","",null,null,null,"","","",{"$f":"IF(K24=\"\", \"\", VLOOKUP(K24,Projekte!C:D,2,FALSE))","v":""}]
[null,null,null,"","",null,"","","","",null,null,null,"","","",{"$f":"IF(K25=\"\", \"\", VLOOKUP(K25,Projekte!C:D,2,FALSE))","v":""}]
[null,null,null,"","",null,"","","","",null,null,null,"","","",{"$f":"IF(K26=\"\", \"\", VLOOKUP(K26,Projekte!C:D,2,FALSE))","v":""}]
[null,null,null,"","",null,"","","","",null,null,null,"","","",{"$f":"IF(K27=\"\", \"\", VLOOKUP(K27,Projekte!C:D,2,FALSE))","v":""}]
[null,null,null,"","",null,"","","","",null,null,null,"","","",{"$f":"IF(K28=\"\", \"\", VLOOKUP(K28,Projekte!C:D,2,FALSE))","v":""}]
[null,null,null,"","",null,"","","","",null,null,null,"","","",{"$f":"IF(K29=\"\", \"\", VLOOKUP(K29,Projekte!C:D,2,FALSE))","v":""}]
[null,null,null,"","",null,"","","","",null,null,null,"","","",{"$f":"IF(K30=\"\", \"\", VLOOKUP(K30,Projekte!C:D,2,FALSE))","v":""}]
[null,null,null,"","",null,"","","","",null,null,null,"","","",{"$f":"IF(K31=\"\", \"\", VLOOKUP(K31,Projekte!C:D,2,FALSE))","v":""}]
[null,null,null,"","",null,"","","","",null,null,null,"","","",{"$f":"IF(K32=\"\", \"\", VLOOKUP(K32,Projekte!C:D,2,FALSE))","v":""}]
[null,null,null,"","",null,"","","","",null,null,null,"","","",{"$f":"IF(K33=\"\", \"\", VLOOKUP(K33,Projekte!C:D,2,FALSE))","v":""}]
[null,null,null,"","",null,"","","","",null,null,null,"","","",{"$f":"IF(K34=\"\", \"\", VLOOKUP(K34,Projekte!C:D,2,FALSE))","v":""}]
[null,null,null,"","",null,"","","","",null,null,null,"","","",{"$f":"IF(K35=\"\", \"\", VLOOKUP(K35,Projekte!C:D,2,FALSE))","v":""}]
[null,null,null,"","",null,{"$f":"IF(K36 = selectThisProjekt,E36, \"\")","v":""},"","","",null,null,null,"","","",{"$f":"IF(K36=\"\", \"\", VLOOKUP(K36,Projekte!C:D,2,FALSE))","v":""}]
[null,null,null,"","",null,"","","","",null,null,null,"","","",{"$f":"IF(K37=\"\", \"\", VLOOKUP(K37,Projekte!C:D,2,FALSE))","v":""}]
[null,null,null,"","",null,"","","","",null,null,null,"","","",{"$f":"IF(K38=\"\", \"\", VLOOKUP(K38,Projekte!C:D,2,FALSE))","v":""}]
[null,null,null,"","",null,"","","","",null,null,null,"","","",{"$f":"IF(K39=\"\", \"\", VLOOKUP(K39,Projekte!C:D,2,FALSE))","v":""}]
[null,null,null,"","",null,"","","","",null,null,null,"","","",{"$f":"IF(K40=\"\", \"\", VLOOKUP(K40,Projekte!C:D,2,FALSE))","v":""}]
[null,null,null,"","",null,"","","","",null,null,null,"","","",{"$f":"IF(K41=\"\", \"\", VLOOKUP(K41,Projekte!C:D,2,FALSE))","v":""}]
[null,null,null,"","",null,"","","","",null,null,null,"","","",{"$f":"IF(K42=\"\", \"\", VLOOKUP(K42,Projekte!C:D,2,FALSE))","v":""}]
[null,null,null,"","",null,"","","","",null,null,null,"","","",{"$f":"IF(K43=\"\", \"\", VLOOKUP(K43,Projekte!C:D,2,FALSE))","v":""}]
[null,null,null,"","",null,"","","","",null,null,null,"","","",{"$f":"IF(K44=\"\", \"\", VLOOKUP(K44,Projekte!C:D,2,FALSE))","v":""}]
[null,null,null,"","",null,"","","","",null,null,null,"","","",{"$f":"IF(K45=\"\", \"\", VLOOKUP(K45,Projekte!C:D,2,FALSE))","v":""}]
[null,null,null,"","",null,"","","","",null,null,null,"","","",{"$f":"IF(K46=\"\", \"\", VLOOKUP(K46,Projekte!C:D,2,FALSE))","v":""}]
[null,null,null,"","",null,"","","","",null,null,null,"","","",{"$f":"IF(K47=\"\", \"\", VLOOKUP(K47,Projekte!C:D,2,FALSE))","v":""}]
[null,null,null,"","",null,"","","","",null,null,null,"","","",{"$f":"IF(K48=\"\", \"\", VLOOKUP(K48,Projekte!C:D,2,FALSE))","v":""}]
[null,null,null,"","",null,"","","","",null,null,null,"","","",{"$f":"IF(K49=\"\", \"\", VLOOKUP(K49,Projekte!C:D,2,FALSE))","v":""}]
[null,null,null,"","",null,"","","","",null,null,null,"","","",{"$f":"IF(K50=\"\", \"\", VLOOKUP(K50,Projekte!C:D,2,FALSE))","v":""}]
[null,null,null,"","",null,"","","","",null,null,null,"","","",{"$f":"IF(K51=\"\", \"\", VLOOKUP(K51,Projekte!C:D,2,FALSE))","v":""}]
[null,null,null,"","",null,"","","","",null,null,null,"","","",{"$f":"IF(K52=\"\", \"\", VLOOKUP(K52,Projekte!C:D,2,FALSE))","v":""}]
[null,null,null,"","",null,"","","","",null,null,null,"","","",{"$f":"IF(K53=\"\", \"\", VLOOKUP(K53,Projekte!C:D,2,FALSE))","v":""}]
[null,null,null,"","",null,"","","","",null,null,null,"","","",{"$f":"IF(K54=\"\", \"\", VLOOKUP(K54,Projekte!C:D,2,FALSE))","v":""}]
[null,null,null,"","",null,"","","","",null,null,null,"","","",{"$f":"IF(K55=\"\", \"\", VLOOKUP(K55,Projekte!C:D,2,FALSE))","v":""}]
[null,null,null,"","",null,"","","","",null,null,null,"","","",{"$f":"IF(K56=\"\", \"\", VLOOKUP(K56,Projekte!C:D,2,FALSE))","v":""}]
[null,null,null,"","",null,"","","","",null,null,null,"","","",{"$f":"IF(K57=\"\", \"\", VLOOKUP(K57,Projekte!C:D,2,FALSE))","v":""}]
[null,null,null,"","",null,"","","","",null,null,null,"","","",{"$f":"IF(K58=\"\", \"\", VLOOKUP(K58,Projekte!C:D,2,FALSE))","v":""}]
[null,null,null,"","",null,"","","","",null,null,null,"","","",{"$f":"IF(K59=\"\", \"\", VLOOKUP(K59,Projekte!C:D,2,FALSE))","v":""}]
[null,null,null,"","",null,"","","","",null,null,null,"","","",{"$f":"IF(K60=\"\", \"\", VLOOKUP(K60,Projekte!C:D,2,FALSE))","v":""}]
[null,null,null,"","",null,"","","","",null,null,null,"","","",{"$f":"IF(K61=\"\", \"\", VLOOKUP(K61,Projekte!C:D,2,FALSE))","v":""}]
[null,null,null,"","",null,"","","","",null,null,null,"","","",{"$f":"IF(K62=\"\", \"\", VLOOKUP(K62,Projekte!C:D,2,FALSE))","v":""}]
[null,null,null,"","",null,"","","","",null,null,null,"","","",{"$f":"IF(K63=\"\", \"\", VLOOKUP(K63,Projekte!C:D,2,FALSE))","v":""}]
[null,null,null,"","",null,"","","","",null,null,null,"","","",{"$f":"IF(K64=\"\", \"\", VLOOKUP(K64,Projekte!C:D,2,FALSE))","v":""}]
[null,null,null,"","",null,"","","","",null,null,null,"","","",{"$f":"IF(K65=\"\", \"\", VLOOKUP(K65,Projekte!C:D,2,FALSE))","v":""}]
[null,null,null,"","",null,"","","","",null,null,null,"","","",{"$f":"IF(K66=\"\", \"\", VLOOKUP(K66,Projekte!C:D,2,FALSE))","v":""}]
[null,null,null,"","",null,"","","","",null,null,null,"","","",{"$f":"IF(K67=\"\", \"\", VLOOKUP(K67,Projekte!C:D,2,FALSE))","v":""}]
[null,null,null,{"$f":"IF(C68=\"\", \"\", C68-B68)","v":""},{"$f":"IF(D68=\"\", \"\", (C68-B68)*24)","v":""},null,{"$f":"IF(K68 = selectThisProjekt,E68, \"\")","v":""},"","","",null,null,null,"","","",{"$f":"IF(K68=\"\", \"\", VLOOKUP(K68,Projekte!C:D,2,FALSE))","v":""}]
[null,null,null,"","",null,"",{"$f":"IF(F69 = \"\", G69, \"\")","v":""},{"$f":"IF(LOWER(F69) = \"r\",G69,\"\")","v":""},{"$f":"IF(AND(F69<>\"\", LOWER(F69) <> \"r\"),G69,\"\")","v":""},null,null,null,"","","",{"$f":"IF(K69=\"\", \"\", VLOOKUP(K69,Projekte!C:D,2,FALSE))","v":""}]
[null,null,null,"","",null,"","","","",null,null,null,{"$f":"IF(M70<>\"\", \"\", IF(F70 = \"\", G70, \"\"))","v":""},{"$f":"IF(M70<>\"\", \"\", IF(LOWER(F70) = \"r\",G70,\"\"))","v":""},{"$f":"IF(M70<>\"\", \"\", IF(AND(F70<>\"\", LOWER(F70) <> \"r\"),G70,\"\"))","v":""},{"$f":"IF(K70=\"\", \"\", VLOOKUP(K70,Projekte!C:D,2,FALSE))","v":""}]
[null,null,null,"","",null,"","","","",null,null,null,"","","",{"$f":"IF(K71=\"\", \"\", VLOOKUP(K71,Projekte!C:D,2,FALSE))","v":""}]
[null,null,null,"","",null,"","","","",null,null,null,"","","",{"$f":"IF(K72=\"\", \"\", VLOOKUP(K72,Projekte!C:D,2,FALSE))","v":""}]
[null,null,null,"","",null,"","","","",null,null,null,"","","",{"$f":"IF(K73=\"\", \"\", VLOOKUP(K73,Projekte!C:D,2,FALSE))","v":""}]
[null,null,null,"","",null,"","","","",null,null,null,"","","",{"$f":"IF(K74=\"\", \"\", VLOOKUP(K74,Projekte!C:D,2,FALSE))","v":""}]
[null,null,null,"","",null,"","","","",null,null,null,"","","",{"$f":"IF(K75=\"\", \"\", VLOOKUP(K75,Projekte!C:D,2,FALSE))","v":""}]
[null,null,null,"","",null,"","","","",null,null,null,"","","",{"$f":"IF(K76=\"\", \"\", VLOOKUP(K76,Projekte!C:D,2,FALSE))","v":""}]
[null,null,null,"","",null,"","","","",null,null,null,"","","",{"$f":"IF(K77=\"\", \"\", VLOOKUP(K77,Projekte!C:D,2,FALSE))","v":""}]
[null,null,null,"","",null,"","","","",null,null,null,"","","",{"$f":"IF(K78=\"\", \"\", VLOOKUP(K78,Projekte!C:D,2,FALSE))","v":""}]
[null,null,null,"","",null,"","","","",null,null,null,"","","",{"$f":"IF(K79=\"\", \"\", VLOOKUP(K79,Projekte!C:D,2,FALSE))","v":""}]
[null,null,null,"","",null,"","","","",null,null,null,"","","",{"$f":"IF(K80=\"\", \"\", VLOOKUP(K80,Projekte!C:D,2,FALSE))","v":""}]
[null,null,null,"","",null,"","","","",null,null,null,"","","",{"$f":"IF(K81=\"\", \"\", VLOOKUP(K81,Projekte!C:D,2,FALSE))","v":""}]
[null,null,null,"","",null,"","","","",null,null,null,"","","",{"$f":"IF(K82=\"\", \"\", VLOOKUP(K82,Projekte!C:D,2,FALSE))","v":""}]
[null,null,null,"","",null,"","","","",null,null,null,"","","",{"$f":"IF(K83=\"\", \"\", VLOOKUP(K83,Projekte!C:D,2,FALSE))","v":""}]
[null,null,null,"","",null,"","","","",null,null,null,"","","",{"$f":"IF(K84=\"\", \"\", VLOOKUP(K84,Projekte!C:D,2,FALSE))","v":""}]
[null,null,null,"","",null,"","","","",null,null,null,"","","",{"$f":"IF(K85=\"\", \"\", VLOOKUP(K85,Projekte!C:D,2,FALSE))","v":""}]
[null,null,null,"","",null,"","","","",null,null,null,"","","",{"$f":"IF(K86=\"\", \"\", VLOOKUP(K86,Projekte!C:D,2,FALSE))","v":""}]
[null,null,null,"","",null,"","","","",null,null,null,"","","",{"$f":"IF(K87=\"\", \"\", VLOOKUP(K87,Projekte!C:D,2,FALSE))","v":""}]
[null,null,null,"","",null,"","","","",null,null,null,"","","",{"$f":"IF(K88=\"\", \"\", VLOOKUP(K88,Projekte!C:D,2,FALSE))","v":""}]
[null,null,null,"","",null,"","","","",null,null,null,"","","",{"$f":"IF(K89=\"\", \"\", VLOOKUP(K89,Projekte!C:D,2,FALSE))","v":""}]
[null,null,null,"","",null,"","","","",null,null,null,"","","",{"$f":"IF(K90=\"\", \"\", VLOOKUP(K90,Projekte!C:D,2,FALSE))","v":""}]
[null,null,null,"","",null,"","","","",null,null,null,"","","",{"$f":"IF(K91=\"\", \"\", VLOOKUP(K91,Projekte!C:D,2,FALSE))","v":""}]
[null,null,null,"","",null,"","","","",null,null,null,"","","",{"$f":"IF(K92=\"\", \"\", VLOOKUP(K92,Projekte!C:D,2,FALSE))","v":""}]
[null,null,null,"","",null,"","","","",null,null,null,"","","",{"$f":"IF(K93=\"\", \"\", VLOOKUP(K93,Projekte!C:D,2,FALSE))","v":""}]
[null,null,null,"","",null,"","","","",null,null,null,"","","",{"$f":"IF(K94=\"\", \"\", VLOOKUP(K94,Projekte!C:D,2,FALSE))","v":""}]
[null,null,null,"","",null,"","","","",null,null,null,"","","",{"$f":"IF(K95=\"\", \"\", VLOOKUP(K95,Projekte!C:D,2,FALSE))","v":""}]
[null,null,null,"","",null,"","","","",null,null,null,"","","",{"$f":"IF(K96=\"\", \"\", VLOOKUP(K96,Projekte!C:D,2,FALSE))","v":""}]
[null,null,null,"","",null,"","","","",null,null,null,"","","",{"$f":"IF(K97=\"\", \"\", VLOOKUP(K97,Projekte!C:D,2,FALSE))","v":""}]
[null,null,null,"","",null,"","","","",null,null,null,"","","",{"$f":"IF(K98=\"\", \"\", VLOOKUP(K98,Projekte!C:D,2,FALSE))","v":""}]
[null,null,null,"","",null,"","","","",null,null,null,"","","",{"$f":"IF(K99=\"\", \"\", VLOOKUP(K99,Projekte!C:D,2,FALSE))","v":""}]
[null,null,null,"","",null,{"$f":"IF(K100 = selectThisProjekt,E100, \"\")","v":""},"","","",null,null,null,"","","",{"$f":"IF(K100=\"\", \"\", VLOOKUP(K100,Projekte!C:D,2,FALSE))","v":""}]
[null,null,null,"","",null,"","","","",null,null,null,"","","",{"$f":"IF(K101=\"\", \"\", VLOOKUP(K101,Projekte!C:D,2,FALSE))","v":""}]
[null,null,null,"","",null,"","","","",null,null,null,"","","",{"$f":"IF(K102=\"\", \"\", VLOOKUP(K102,Projekte!C:D,2,FALSE))","v":""}]
[null,null,null,"","",null,"","","","",null,null,null,"","","",{"$f":"IF(K103=\"\", \"\", VLOOKUP(K103,Projekte!C:D,2,FALSE))","v":""}]
[null,null,null,"","",null,"","","","",null,null,null,"","","",{"$f":"IF(K104=\"\", \"\", VLOOKUP(K104,Projekte!C:D,2,FALSE))","v":""}]
[null,null,null,"","",null,"","","","",null,null,null,"","","",{"$f":"IF(K105=\"\", \"\", VLOOKUP(K105,Projekte!C:D,2,FALSE))","v":""}]
[null,null,null,"","",null,"","","","",null,null,null,"","","",{"$f":"IF(K106=\"\", \"\", VLOOKUP(K106,Projekte!C:D,2,FALSE))","v":""}]
[null,null,null,"","",null,"","","","",null,null,null,"","","",{"$f":"IF(K107=\"\", \"\", VLOOKUP(K107,Projekte!C:D,2,FALSE))","v":""}]
[null,null,null,"","",null,"","","","",null,null,null,"","","",{"$f":"IF(K108=\"\", \"\", VLOOKUP(K108,Projekte!C:D,2,FALSE))","v":""}]
[null,null,null,"","",null,"","","","",null,null,null,"","","",{"$f":"IF(K109=\"\", \"\", VLOOKUP(K109,Projekte!C:D,2,FALSE))","v":""}]
[null,null,null,"","",null,"","","","",null,null,null,"","","",{"$f":"IF(K110=\"\", \"\", VLOOKUP(K110,Projekte!C:D,2,FALSE))","v":""}]
[null,null,null,"","",null,"","","","",null,null,null,"","","",{"$f":"IF(K111=\"\", \"\", VLOOKUP(K111,Projekte!C:D,2,FALSE))","v":""}]
[null,null,null,"","",null,"","","","",null,null,null,"","","",{"$f":"IF(K112=\"\", \"\", VLOOKUP(K112,Projekte!C:D,2,FALSE))","v":""}]
[null,null,null,"","",null,"","","","",null,null,null,"","","",{"$f":"IF(K113=\"\", \"\", VLOOKUP(K113,Projekte!C:D,2,FALSE))","v":""}]
[null,null,null,"","",null,"","","","",null,null,null,"","","",{"$f":"IF(K114=\"\", \"\", VLOOKUP(K114,Projekte!C:D,2,FALSE))","v":""}]
[null,null,null,"","",null,"","","","",null,null,null,"","","",{"$f":"IF(K115=\"\", \"\", VLOOKUP(K115,Projekte!C:D,2,FALSE))","v":""}]
[null,null,null,"","",null,"","","","",null,null,null,"","","",{"$f":"IF(K116=\"\", \"\", VLOOKUP(K116,Projekte!C:D,2,FALSE))","v":""}]
[null,null,null,"","",null,"","","","",null,null,null,"","","",{"$f":"IF(K117=\"\", \"\", VLOOKUP(K117,Projekte!C:D,2,FALSE))","v":""}]
[null,null,null,"","",null,"","","","",null,null,null,"","","",{"$f":"IF(K118=\"\", \"\", VLOOKUP(K118,Projekte!C:D,2,FALSE))","v":""}]
[null,null,null,"","",null,"","","","",null,null,null,"","","",{"$f":"IF(K119=\"\", \"\", VLOOKUP(K119,Projekte!C:D,2,FALSE))","v":""}]
[null,null,null,"","",null,"","","","",null,null,null,"","","",{"$f":"IF(K120=\"\", \"\", VLOOKUP(K120,Projekte!C:D,2,FALSE))","v":""}]
[null,null,null,"","",null,"","","","",null,null,null,"","","",{"$f":"IF(K121=\"\", \"\", VLOOKUP(K121,Projekte!C:D,2,FALSE))","v":""}]
[null,null,null,"","",null,"","","","",null,null,null,"","","",{"$f":"IF(K122=\"\", \"\", VLOOKUP(K122,Projekte!C:D,2,FALSE))","v":""}]
[null,null,null,"","",null,{"$f":"IF(K123 = selectThisProjekt,E123, \"\")","v":""},"","","",null,null,null,"","","",{"$f":"IF(K123=\"\", \"\", VLOOKUP(K123,Projekte!C:D,2,FALSE))","v":""}]
[null,null,null,"","",null,"","","","",null,null,null,"","","",{"$f":"IF(K124=\"\", \"\", VLOOKUP(K124,Projekte!C:D,2,FALSE))","v":""}]
[null,null,null,"","",null,{"$f":"IF(K125 = selectThisProjekt,E125, \"\")","v":""},"","","",null,null,null,"","","",{"$f":"IF(K125=\"\", \"\", VLOOKUP(K125,Projekte!C:D,2,FALSE))","v":""}]
[null,null,null,"","",null,"","","","",null,null,null,"","","",{"$f":"IF(K126=\"\", \"\", VLOOKUP(K126,Projekte!C:D,2,FALSE))","v":""}]
[null,null,null,"","",null,"","","","",null,null,null,"","","",{"$f":"IF(K127=\"\", \"\", VLOOKUP(K127,Projekte!C:D,2,FALSE))","v":""}]
[null,null,null,"","",null,"","","","",null,null,null,"","","",{"$f":"IF(K128=\"\", \"\", VLOOKUP(K128,Projekte!C:D,2,FALSE))","v":""}]
[null,null,null,"","",null,"","","","",null,null,null,"","","",{"$f":"IF(K129=\"\", \"\", VLOOKUP(K129,Projekte!C:D,2,FALSE))","v":""}]
[null,null,null,"","",null,"","","","",null,null,null,"","","",{"$f":"IF(K130=\"\", \"\", VLOOKUP(K130,Projekte!C:D,2,FALSE))","v":""}]
[null,null,null,"","",null,"","","","",null,null,null,"","","",{"$f":"IF(K131=\"\", \"\", VLOOKUP(K131,Projekte!C:D,2,FALSE))","v":""}]
[null,null,null,{"$f":"IF(C132=\"\", \"\", C132-B132)","v":""},{"$f":"IF(D132=\"\", \"\", (C132-B132)*24)","v":""},null,{"$f":"IF(K132 = selectThisProjekt,E132, \"\")","v":""},"","","",null,null,null,"","","",{"$f":"IF(K132=\"\", \"\", VLOOKUP(K132,Projekte!C:D,2,FALSE))","v":""}]
[null,null,null,"","",null,"",{"$f":"IF(F133 = \"\", G133, \"\")","v":""},{"$f":"IF(LOWER(F133) = \"r\",G133,\"\")","v":""},{"$f":"IF(AND(F133<>\"\", LOWER(F133) <> \"r\"),G133,\"\")","v":""},null,null,null,"","","",{"$f":"IF(K133=\"\", \"\", VLOOKUP(K133,Projekte!C:D,2,FALSE))","v":""}]
[null,null,null,"","",null,"","","","",null,null,null,{"$f":"IF(M134<>\"\", \"\", IF(F134 = \"\", G134, \"\"))","v":""},{"$f":"IF(M134<>\"\", \"\", IF(LOWER(F134) = \"r\",G134,\"\"))","v":""},{"$f":"IF(M134<>\"\", \"\", IF(AND(F134<>\"\", LOWER(F134) <> \"r\"),G134,\"\"))","v":""},{"$f":"IF(K134=\"\", \"\", VLOOKUP(K134,Projekte!C:D,2,FALSE))","v":""}]
[null,null,null,"","",null,"","","","",null,null,null,"","","",{"$f":"IF(K135=\"\", \"\", VLOOKUP(K135,Projekte!C:D,2,FALSE))","v":""}]
[null,null,null,"","",null,"","","","",null,null,null,"","","",{"$f":"IF(K136=\"\", \"\", VLOOKUP(K136,Projekte!C:D,2,FALSE))","v":""}]
[null,null,null,"","",null,"","","","",null,null,null,"","","",{"$f":"IF(K137=\"\", \"\", VLOOKUP(K137,Projekte!C:D,2,FALSE))","v":""}]
[null,null,null,"","",null,"","","","",null,null,null,"","","",{"$f":"IF(K138=\"\", \"\", VLOOKUP(K138,Projekte!C:D,2,FALSE))","v":""}]
[null,null,null,"","",null,"","","","",null,null,null,"","","",{"$f":"IF(K139=\"\", \"\", VLOOKUP(K139,Projekte!C:D,2,FALSE))","v":""}]
[null,null,null,"","",null,"","","","",null,null,null,"","","",{"$f":"IF(K140=\"\", \"\", VLOOKUP(K140,Projekte!C:D,2,FALSE))","v":""}]
[null,null,null,"","",null,"","","","",null,null,null,"","","",{"$f":"IF(K141=\"\", \"\", VLOOKUP(K141,Projekte!C:D,2,FALSE))","v":""}]
[null,null,null,"","",null,"","","","",null,null,null,"","","",{"$f":"IF(K142=\"\", \"\", VLOOKUP(K142,Projekte!C:D,2,FALSE))","v":""}]
[null,null,null,"","",null,"","","","",null,null,null,"","","",{"$f":"IF(K143=\"\", \"\", VLOOKUP(K143,Projekte!C:D,2,FALSE))","v":""}]
[null,null,null,"","",null,"","","","",null,null,null,"","","",{"$f":"IF(K144=\"\", \"\", VLOOKUP(K144,Projekte!C:D,2,FALSE))","v":""}]
[null,null,null,"","",null,"","","","",null,null,null,"","","",{"$f":"IF(K145=\"\", \"\", VLOOKUP(K145,Projekte!C:D,2,FALSE))","v":""}]
[null,null,null,"","",null,"","","","",null,null,null,"","","",{"$f":"IF(K146=\"\", \"\", VLOOKUP(K146,Projekte!C:D,2,FALSE))","v":""}]
[null,null,null,"","",null,"","","","",null,null,null,"","","",{"$f":"IF(K147=\"\", \"\", VLOOKUP(K147,Projekte!C:D,2,FALSE))","v":""}]
[null,null,null,"","",null,"","","","",null,null,null,"","","",{"$f":"IF(K148=\"\", \"\", VLOOKUP(K148,Projekte!C:D,2,FALSE))","v":""}]
[null,null,null,"","",null,"","","","",null,null,null,"","","",{"$f":"IF(K149=\"\", \"\", VLOOKUP(K149,Projekte!C:D,2,FALSE))","v":""}]
[null,null,null,"","",null,"","","","",null,null,null,"","","",{"$f":"IF(K150=\"\", \"\", VLOOKUP(K150,Projekte!C:D,2,FALSE))","v":""}]
[null,null,null,"","",null,"","","","",null,null,null,"","","",{"$f":"IF(K151=\"\", \"\", VLOOKUP(K151,Projekte!C:D,2,FALSE))","v":""}]
[null,null,null,"","",null,"","","","",null,null,null,"","","",{"$f":"IF(K152=\"\", \"\", VLOOKUP(K152,Projekte!C:D,2,FALSE))","v":""}]
[null,null,null,"","",null,"","","","",null,null,null,"","","",{"$f":"IF(K153=\"\", \"\", VLOOKUP(K153,Projekte!C:D,2,FALSE))","v":""}]
[null,null,null,"","",null,"","","","",null,null,null,"","","",{"$f":"IF(K154=\"\", \"\", VLOOKUP(K154,Projekte!C:D,2,FALSE))","v":""}]
[null,null,null,"","",null,"","","","",null,null,null,"","","",{"$f":"IF(K155=\"\", \"\", VLOOKUP(K155,Projekte!C:D,2,FALSE))","v":""}]
[null,null,null,"","",null,"","","","",null,null,null,"","","",{"$f":"IF(K156=\"\", \"\", VLOOKUP(K156,Projekte!C:D,2,FALSE))","v":""}]
[null,null,null,"","",null,"","","","",null,null,null,"","","",{"$f":"IF(K157=\"\", \"\", VLOOKUP(K157,Projekte!C:D,2,FALSE))","v":""}]
[null,null,null,"","",null,"","","","",null,null,null,"","","",{"$f":"IF(K158=\"\", \"\", VLOOKUP(K158,Projekte!C:D,2,FALSE))","v":""}]
[null,null,null,"","",null,"","","","",null,null,null,"","","",{"$f":"IF(K159=\"\", \"\", VLOOKUP(K159,Projekte!C:D,2,FALSE))","v":""}]
[null,null,null,"","",null,"","","","",null,null,null,"","","",{"$f":"IF(K160=\"\", \"\", VLOOKUP(K160,Projekte!C:D,2,FALSE))","v":""}]
[null,null,null,"","",null,"","","","",null,null,null,"","","",{"$f":"IF(K161=\"\", \"\", VLOOKUP(K161,Projekte!C:D,2,FALSE))","v":""}]
[null,null,null,"","",null,"","","","",null,null,null,"","","",{"$f":"IF(K162=\"\", \"\", VLOOKUP(K162,Projekte!C:D,2,FALSE))","v":""}]
[null,null,null,"","",null,"","","","",null,null,null,"","","",{"$f":"IF(K163=\"\", \"\", VLOOKUP(K163,Projekte!C:D,2,FALSE))","v":""}]
[null,null,null,"","",null,{"$f":"IF(K164 = selectThisProjekt,E164, \"\")","v":""},"","","",null,null,null,"","","",{"$f":"IF(K164=\"\", \"\", VLOOKUP(K164,Projekte!C:D,2,FALSE))","v":""}]
[null,null,null,"","",null,"","","","",null,null,null,"","","",{"$f":"IF(K165=\"\", \"\", VLOOKUP(K165,Projekte!C:D,2,FALSE))","v":""}]
[null,null,null,"","",null,"","","","",null,null,null,"","","",{"$f":"IF(K166=\"\", \"\", VLOOKUP(K166,Projekte!C:D,2,FALSE))","v":""}]
[null,null,null,"","",null,"","","","",null,null,null,"","","",{"$f":"IF(K167=\"\", \"\", VLOOKUP(K167,Projekte!C:D,2,FALSE))","v":""}]
[null,null,null,"","",null,"","","","",null,null,null,"","","",{"$f":"IF(K168=\"\", \"\", VLOOKUP(K168,Projekte!C:D,2,FALSE))","v":""}]
[null,null,null,"","",null,"","","","",null,null,null,"","","",{"$f":"IF(K169=\"\", \"\", VLOOKUP(K169,Projekte!C:D,2,FALSE))","v":""}]
[null,null,null,"","",null,{"$f":"IF(K170 = selectThisProjekt,E170, \"\")","v":""},"","","",null,null,null,"","","",{"$f":"IF(K170=\"\", \"\", VLOOKUP(K170,Projekte!C:D,2,FALSE))","v":""}]
[null,null,null,"","",null,"","","","",null,null,null,"","","",{"$f":"IF(K171=\"\", \"\", VLOOKUP(K171,Projekte!C:D,2,FALSE))","v":""}]
[null,null,null,"","",null,"","","","",null,null,null,"","","",{"$f":"IF(K172=\"\", \"\", VLOOKUP(K172,Projekte!C:D,2,FALSE))","v":""}]
[null,null,null,"","",null,"","","","",null,null,null,"","","",{"$f":"IF(K173=\"\", \"\", VLOOKUP(K173,Projekte!C:D,2,FALSE))","v":""}]
[null,null,null,"","",null,"","","","",null,null,null,"","","",{"$f":"IF(K174=\"\", \"\", VLOOKUP(K174,Projekte!C:D,2,FALSE))","v":""}]
[null,null,null,"","",null,"","","","",null,null,null,"","","",{"$f":"IF(K175=\"\", \"\", VLOOKUP(K175,Projekte!C:D,2,FALSE))","v":""}]
[null,null,null,"","",null,"","","","",null,null,null,"","","",{"$f":"IF(K176=\"\", \"\", VLOOKUP(K176,Projekte!C:D,2,FALSE))","v":""}]
[null,null,null,"","",null,"","","","",null,null,null,"","","",{"$f":"IF(K177=\"\", \"\", VLOOKUP(K177,Projekte!C:D,2,FALSE))","v":""}]
[null,null,null,"","",null,"","","","",null,null,null,"","","",{"$f":"IF(K178=\"\", \"\", VLOOKUP(K178,Projekte!C:D,2,FALSE))","v":""}]
[null,null,null,"","",null,"","","","",null,null,null,"","","",{"$f":"IF(K179=\"\", \"\", VLOOKUP(K179,Projekte!C:D,2,FALSE))","v":""}]
[null,null,null,"","",null,"","","","",null,null,null,"","","",{"$f":"IF(K180=\"\", \"\", VLOOKUP(K180,Projekte!C:D,2,FALSE))","v":""}]
[null,null,null,"","",null,"","","","",null,null,null,"","","",{"$f":"IF(K181=\"\", \"\", VLOOKUP(K181,Projekte!C:D,2,FALSE))","v":""}]
[null,null,null,"","",null,"","","","",null,null,null,"","","",{"$f":"IF(K182=\"\", \"\", VLOOKUP(K182,Projekte!C:D,2,FALSE))","v":""}]
[null,null,null,"","",null,"","","","",null,null,null,"","","",{"$f":"IF(K183=\"\", \"\", VLOOKUP(K183,Projekte!C:D,2,FALSE))","v":""}]
[null,null,null,"","",null,"","","","",null,null,null,"","","",{"$f":"IF(K184=\"\", \"\", VLOOKUP(K184,Projekte!C:D,2,FALSE))","v":""}]
[null,null,null,"","",null,"","","","",null,null,null,"","","",{"$f":"IF(K185=\"\", \"\", VLOOKUP(K185,Projekte!C:D,2,FALSE))","v":""}]
[null,null,null,"","",null,"","","","",null,null,null,"","","",{"$f":"IF(K186=\"\", \"\", VLOOKUP(K186,Projekte!C:D,2,FALSE))","v":""}]
[null,null,null,"","",null,"","","","",null,null,null,"","","",{"$f":"IF(K187=\"\", \"\", VLOOKUP(K187,Projekte!C:D,2,FALSE))","v":""}]
[null,null,null,"","",null,"","","","",null,null,null,"","","",{"$f":"IF(K188=\"\", \"\", VLOOKUP(K188,Projekte!C:D,2,FALSE))","v":""}]
[null,null,null,"","",null,"","","","",null,null,null,"","","",{"$f":"IF(K189=\"\", \"\", VLOOKUP(K189,Projekte!C:D,2,FALSE))","v":""}]
[null,null,null,"","",null,"","","","",null,null,null,"","","",{"$f":"IF(K190=\"\", \"\", VLOOKUP(K190,Projekte!C:D,2,FALSE))","v":""}]
[null,null,null,"","",null,"","","","",null,null,null,"","","",{"$f":"IF(K191=\"\", \"\", VLOOKUP(K191,Projekte!C:D,2,FALSE))","v":""}]
[null,null,null,"","",null,"","","","",null,null,null,"","","",{"$f":"IF(K192=\"\", \"\", VLOOKUP(K192,Projekte!C:D,2,FALSE))","v":""}]
[null,null,null,"","",null,"","","","",null,null,null,"","","",{"$f":"IF(K193=\"\", \"\", VLOOKUP(K193,Projekte!C:D,2,FALSE))","v":""}]
[null,null,null,"","",null,"","","","",null,null,null,"","","",{"$f":"IF(K194=\"\", \"\", VLOOKUP(K194,Projekte!C:D,2,FALSE))","v":""}]
[null,null,null,"","",null,"","","","",null,null,null,"","","",{"$f":"IF(K195=\"\", \"\", VLOOKUP(K195,Projekte!C:D,2,FALSE))","v":""}]
[null,null,null,"","",null,"","","","",null,null,null,"","","",{"$f":"IF(K196=\"\", \"\", VLOOKUP(K196,Projekte!C:D,2,FALSE))","v":""}]
[null,null,null,"","",null,"","","","",null,null,null,"","","",{"$f":"IF(K197=\"\", \"\", VLOOKUP(K197,Projekte!C:D,2,FALSE))","v":""}]
[null,null,null,"","",null,"","","","",null,null,null,{"$f":"IF(M198<>\"\", \"\", IF(F198 = \"\", G198, \"\"))","v":""},{"$f":"IF(M198<>\"\", \"\", IF(LOWER(F198) = \"r\",G198,\"\"))","v":""},{"$f":"IF(M198<>\"\", \"\", IF(AND(F198<>\"\", LOWER(F198) <> \"r\"),G198,\"\"))","v":""},{"$f":"IF(K198=\"\", \"\", VLOOKUP(K198,Projekte!C:D,2,FALSE))","v":""}]
[null,null,null,"","",null,"","","","",null,null,null,"","","",{"$f":"IF(K199=\"\", \"\", VLOOKUP(K199,Projekte!C:D,2,FALSE))","v":""}]
[null,null,null,"","",null,"","","","",null,null,null,"","","",{"$f":"IF(K200=\"\", \"\", VLOOKUP(K200,Projekte!C:D,2,FALSE))","v":""}]
[null,null,null,"","",null,"","","","",null,null,null,"","","",{"$f":"IF(K201=\"\", \"\", VLOOKUP(K201,Projekte!C:D,2,FALSE))","v":""}]
[null,null,null,"","",null,"","","","",null,null,null,"","","",{"$f":"IF(K202=\"\", \"\", VLOOKUP(K202,Projekte!C:D,2,FALSE))","v":""}]
[null,null,null,"","",null,{"$f":"IF(K203 = selectThisProjekt,E203, \"\")","v":""},"","","",null,null,null,"","","",{"$f":"IF(K203=\"\", \"\", VLOOKUP(K203,Projekte!C:D,2,FALSE))","v":""}]
[null,null,null,"<Ende Formeln>"]

{"sheet":"Feb","index":2,"n_rows":204,"n_cols":17,"rows_kept":204,"cut":false,"hidden":false,"merged":[[0,13,0,15],[2,0,2,2]]}
[null,null,"DL-Zeiten von",{"$f":"AssignedToCfg","v":{"$error":"#REF!"}},null,null,null,null,null,null,null,null,null,"Faktura nicht erfasst"]
["Datum","Beginn","Ende","h","h,xx","r: Reise, \nx: nicht berechnen","Summe","Dienstleistung","Reise","nicht berechnen",null,"Tätigkeit","Faktura erfasst","Dienstleistung","Reise","nicht berechnen","Projektname"]
[null,null,null,null,null,"Summe",{"$f":"SUM(G4:G203)","v":0},{"$f":"SUM(H4:H203)","v":0},{"$f":"SUM(I4:I203)","v":0},{"$f":"SUM(J4:J203)","v":0},null,"<- für diesen ProjektBereich",null,{"$f":"SUM(N4:N203)","v":0},{"$f":"SUM(O4:O203)","v":0},{"$f":"SUM(P4:P203)","v":0}]
[null,null,null,{"$f":"IF(C4=\"\", \"\", C4-B4)","v":""},{"$f":"IF(D4=\"\", \"\", (C4-B4)*24)","v":""},null,{"$f":"IF(K4 = selectThisProjekt,E4, \"\")","v":""},{"$f":"IF(F4 = \"\", G4, \"\")","v":""},{"$f":"IF(LOWER(F4) = \"r\",G4,\"\")","v":""},{"$f":"IF(AND(F4<>\"\", LOWER(F4) <> \"r\"),G4,\"\")","v":""},null,null,null,{"$f":"IF(M4<>\"\", \"\", IF(F4 = \"\", G4, \"\"))","v":""},{"$f":"IF(M4<>\"\", \"\", IF(LOWER(F4) = \"r\",G4,\"\"))","v":""},{"$f":"IF(M4<>\"\", \"\", IF(AND(F4<>\"\", LOWER(F4) <> \"r\"),G4,\"\"))","v":""},{"$f":"IF(K4=\"\", \"\", VLOOKUP(K4,Projekte!C:D,2,FALSE))","v":""}]
[null,null,null,"","",null,"",{"$f":"IF(F5 = \"\", G5, \"\")","v":""},{"$f":"IF(LOWER(F5) = \"r\",G5,\"\")","v":""},{"$f":"IF(AND(F5<>\"\", LOWER(F5) <> \"r\"),G5,\"\")","v":""},null,null,null,{"$f":"IF(M5<>\"\", \"\", IF(F5 = \"\", G5, \"\"))","v":""},{"$f":"IF(M5<>\"\", \"\", IF(LOWER(F5) = \"r\",G5,\"\"))","v":""},{"$f":"IF(M5<>\"\", \"\", IF(AND(F5<>\"\", LOWER(F5) <> \"r\"),G5,\"\"))","v":""},{"$f":"IF(K5=\"\", \"\", VLOOKUP(K5,Projekte!C:D,2,FALSE))","v":""}]
[null,null,null,"","",null,"","","","",null,null,null,{"$f":"IF(M6<>\"\", \"\", IF(F6 = \"\", G6, \"\"))","v":""},{"$f":"IF(M6<>\"\", \"\", IF(LOWER(F6) = \"r\",G6,\"\"))","v":""},{"$f":"IF(M6<>\"\", \"\", IF(AND(F6<>\"\", LOWER(F6) <> \"r\"),G6,\"\"))","v":""},{"$f":"IF(K6=\"\", \"\", VLOOKUP(K6,Projekte!C:D,2,FALSE))","v":""}]
[null,null,null,"","",null,"","","","",null,null,null,"","","",{"$f":"IF(K7=\"\", \"\", VLOOKUP(K7,Projekte!C:D,2,FALSE))","v":""}]
[null,null,null,"","",null,"","","","",null,null,null,"","","",{"$f":"IF(K8=\"\", \"\", VLOOKUP(K8,Projekte!C:D,2,FALSE))","v":""}]
[null,null,null,"","",null,"","","","",null,null,null,"","","",{"$f":"IF(K9=\"\", \"\", VLOOKUP(K9,Projekte!C:D,2,FALSE))","v":""}]
[null,null,null,"","",null,"","","","",null,null,null,"","","",{"$f":"IF(K10=\"\", \"\", VLOOKUP(K10,Projekte!C:D,2,FALSE))","v":""}]
[null,null,null,"","",null,"","","","",null,null,null,"","","",{"$f":"IF(K11=\"\", \"\", VLOOKUP(K11,Projekte!C:D,2,FALSE))","v":""}]
[null,null,null,"","",null,"","","","",null,null,null,"","","",{"$f":"IF(K12=\"\", \"\", VLOOKUP(K12,Projekte!C:D,2,FALSE))","v":""}]
[null,null,null,"","",null,"","","","",null,null,null,"","","",{"$f":"IF(K13=\"\", \"\", VLOOKUP(K13,Projekte!C:D,2,FALSE))","v":""}]
[null,null,null,"","",null,"","","","",null,null,null,"","","",{"$f":"IF(K14=\"\", \"\", VLOOKUP(K14,Projekte!C:D,2,FALSE))","v":""}]
[null,null,null,"","",null,"","","","",null,null,null,"","","",{"$f":"IF(K15=\"\", \"\", VLOOKUP(K15,Projekte!C:D,2,FALSE))","v":""}]
[null,null,null,"","",null,"","","","",null,null,null,"","","",{"$f":"IF(K16=\"\", \"\", VLOOKUP(K16,Projekte!C:D,2,FALSE))","v":""}]
[null,null,null,"","",null,"","","","",null,null,null,"","","",{"$f":"IF(K17=\"\", \"\", VLOOKUP(K17,Projekte!C:D,2,FALSE))","v":""}]
[null,null,null,"","",null,"","","","",null,null,null,"","","",{"$f":"IF(K18=\"\", \"\", VLOOKUP(K18,Projekte!C:D,2,FALSE))","v":""}]
[null,null,null,"","",null,"","","","",null,null,null,"","","",{"$f":"IF(K19=\"\", \"\", VLOOKUP(K19,Projekte!C:D,2,FALSE))","v":""}]
[null,null,null,"","",null,"","","","",null,null,null,"","","",{"$f":"IF(K20=\"\", \"\", VLOOKUP(K20,Projekte!C:D,2,FALSE))","v":""}]
[null,null,null,"","",null,"","","","",null,null,null,"","","",{"$f":"IF(K21=\"\", \"\", VLOOKUP(K21,Projekte!C:D,2,FALSE))","v":""}]
[null,null,null,"","",null,"","","","",null,null,null,"","","",{"$f":"IF(K22=\"\", \"\", VLOOKUP(K22,Projekte!C:D,2,FALSE))","v":""}]
[null,null,null,"","",null,"","","","",null,null,null,"","","",{"$f":"IF(K23=\"\", \"\", VLOOKUP(K23,Projekte!C:D,2,FALSE))","v":""}]
[null,null,null,"","",null,"","","","",null,null,null,"","","",{"$f":"IF(K24=\"\", \"\", VLOOKUP(K24,Projekte!C:D,2,FALSE))","v":""}]
[null,null,null,"","",null,"","","","",null,null,null,"","","",{"$f":"IF(K25=\"\", \"\", VLOOKUP(K25,Projekte!C:D,2,FALSE))","v":""}]
[null,null,null,"","",null,"","","","",null,null,null,"","","",{"$f":"IF(K26=\"\", \"\", VLOOKUP(K26,Projekte!C:D,2,FALSE))","v":""}]
[null,null,null,"","",null,"","","","",null,null,null,"","","",{"$f":"IF(K27=\"\", \"\", VLOOKUP(K27,Projekte!C:D,2,FALSE))","v":""}]
[null,null,null,"","",null,"","","","",null,null,null,"","","",{"$f":"IF(K28=\"\", \"\", VLOOKUP(K28,Projekte!C:D,2,FALSE))","v":""}]
[null,null,null,"","",null,"","","","",null,null,null,"","","",{"$f":"IF(K29=\"\", \"\", VLOOKUP(K29,Projekte!C:D,2,FALSE))","v":""}]
[null,null,null,"","",null,"","","","",null,null,null,"","","",{"$f":"IF(K30=\"\", \"\", VLOOKUP(K30,Projekte!C:D,2,FALSE))","v":""}]
[null,null,null,"","",null,"","","","",null,null,null,"","","",{"$f":"IF(K31=\"\", \"\", VLOOKUP(K31,Projekte!C:D,2,FALSE))","v":""}]
[null,null,null,"","",null,"","","","",null,null,null,"","","",{"$f":"IF(K32=\"\", \"\", VLOOKUP(K32,Projekte!C:D,2,FALSE))","v":""}]
[null,null,null,"","",null,"","","","",null,null,null,"","","",{"$f":"IF(K33=\"\", \"\", VLOOKUP(K33,Projekte!C:D,2,FALSE))","v":""}]
[null,null,null,"","",null,"","","","",null,null,null,"","","",{"$f":"IF(K34=\"\", \"\", VLOOKUP(K34,Projekte!C:D,2,FALSE))","v":""}]
[null,null,null,"","",null,"","","","",null,null,null,"","","",{"$f":"IF(K35=\"\", \"\", VLOOKUP(K35,Projekte!C:D,2,FALSE))","v":""}]
[null,null,null,"","",null,{"$f":"IF(K36 = selectThisProjekt,E36, \"\")","v":""},"","","",null,null,null,"","","",{"$f":"IF(K36=\"\", \"\", VLOOKUP(K36,Projekte!C:D,2,FALSE))","v":""}]
[null,null,null,"","",null,"","","","",null,null,null,"","","",{"$f":"IF(K37=\"\", \"\", VLOOKUP(K37,Projekte!C:D,2,FALSE))","v":""}]
[null,null,null,"","",null,"","","","",null,null,null,"","","",{"$f":"IF(K38=\"\", \"\", VLOOKUP(K38,Projekte!C:D,2,FALSE))","v":""}]
[null,null,null,"","",null,"","","","",null,null,null,"","","",{"$f":"IF(K39=\"\", \"\", VLOOKUP(K39,Projekte!C:D,2,FALSE))","v":""}]
[null,null,null,"","",null,"","","","",null,null,null,"","","",{"$f":"IF(K40=\"\", \"\", VLOOKUP(K40,Projekte!C:D,2,FALSE))","v":""}]
[null,null,null,"","",null,"","","","",null,null,null,"","","",{"$f":"IF(K41=\"\", \"\", VLOOKUP(K41,Projekte!C:D,2,FALSE))","v":""}]
[null,null,null,"","",null,"","","","",null,null,null,"","","",{"$f":"IF(K42=\"\", \"\", VLOOKUP(K42,Projekte!C:D,2,FALSE))","v":""}]
[null,null,null,"","",null,"","","","",null,null,null,"","","",{"$f":"IF(K43=\"\", \"\", VLOOKUP(K43,Projekte!C:D,2,FALSE))","v":""}]
[null,null,null,"","",null,"","","","",null,null,null,"","","",{"$f":"IF(K44=\"\", \"\", VLOOKUP(K44,Projekte!C:D,2,FALSE))","v":""}]
[null,null,null,"","",null,"","","","",null,null,null,"","","",{"$f":"IF(K45=\"\", \"\", VLOOKUP(K45,Projekte!C:D,2,FALSE))","v":""}]
[null,null,null,"","",null,"","","","",null,null,null,"","","",{"$f":"IF(K46=\"\", \"\", VLOOKUP(K46,Projekte!C:D,2,FALSE))","v":""}]
[null,null,null,"","",null,"","","","",null,null,null,"","","",{"$f":"IF(K47=\"\", \"\", VLOOKUP(K47,Projekte!C:D,2,FALSE))","v":""}]
[null,null,null,"","",null,"","","","",null,null,null,"","","",{"$f":"IF(K48=\"\", \"\", VLOOKUP(K48,Projekte!C:D,2,FALSE))","v":""}]
[null,null,null,"","",null,"","","","",null,null,null,"","","",{"$f":"IF(K49=\"\", \"\", VLOOKUP(K49,Projekte!C:D,2,FALSE))","v":""}]
[null,null,null,"","",null,"","","","",null,null,null,"","","",{"$f":"IF(K50=\"\", \"\", VLOOKUP(K50,Projekte!C:D,2,FALSE))","v":""}]
[null,null,null,"","",null,"","","","",null,null,null,"","","",{"$f":"IF(K51=\"\", \"\", VLOOKUP(K51,Projekte!C:D,2,FALSE))","v":""}]
[null,null,null,"","",null,"","","","",null,null,null,"","","",{"$f":"IF(K52=\"\", \"\", VLOOKUP(K52,Projekte!C:D,2,FALSE))","v":""}]
[null,null,null,"","",null,"","","","",null,null,null,"","","",{"$f":"IF(K53=\"\", \"\", VLOOKUP(K53,Projekte!C:D,2,FALSE))","v":""}]
[null,null,null,"","",null,"","","","",null,null,null,"","","",{"$f":"IF(K54=\"\", \"\", VLOOKUP(K54,Projekte!C:D,2,FALSE))","v":""}]
[null,null,null,"","",null,"","","","",null,null,null,"","","",{"$f":"IF(K55=\"\", \"\", VLOOKUP(K55,Projekte!C:D,2,FALSE))","v":""}]
[null,null,null,"","",null,"","","","",null,null,null,"","","",{"$f":"IF(K56=\"\", \"\", VLOOKUP(K56,Projekte!C:D,2,FALSE))","v":""}]
[null,null,null,"","",null,"","","","",null,null,null,"","","",{"$f":"IF(K57=\"\", \"\", VLOOKUP(K57,Projekte!C:D,2,FALSE))","v":""}]
[null,null,null,"","",null,"","","","",null,null,null,"","","",{"$f":"IF(K58=\"\", \"\", VLOOKUP(K58,Projekte!C:D,2,FALSE))","v":""}]
[null,null,null,"","",null,"","","","",null,null,null,"","","",{"$f":"IF(K59=\"\", \"\", VLOOKUP(K59,Projekte!C:D,2,FALSE))","v":""}]
[null,null,null,"","",null,"","","","",null,null,null,"","","",{"$f":"IF(K60=\"\", \"\", VLOOKUP(K60,Projekte!C:D,2,FALSE))","v":""}]
[null,null,null,"","",null,"","","","",null,null,null,"","","",{"$f":"IF(K61=\"\", \"\", VLOOKUP(K61,Projekte!C:D,2,FALSE))","v":""}]
[null,null,null,"","",null,"","","","",null,null,null,"","","",{"$f":"IF(K62=\"\", \"\", VLOOKUP(K62,Projekte!C:D,2,FALSE))","v":""}]
[null,null,null,"","",null,"","","","",null,null,null,"","","",{"$f":"IF(K63=\"\", \"\", VLOOKUP(K63,Projekte!C:D,2,FALSE))","v":""}]
[null,null,null,"","",null,"","","","",null,null,null,"","","",{"$f":"IF(K64=\"\", \"\", VLOOKUP(K64,Projekte!C:D,2,FALSE))","v":""}]
[null,null,null,"","",null,"","","","",null,null,null,"","","",{"$f":"IF(K65=\"\", \"\", VLOOKUP(K65,Projekte!C:D,2,FALSE))","v":""}]
[null,null,null,"","",null,"","","","",null,null,null,"","","",{"$f":"IF(K66=\"\", \"\", VLOOKUP(K66,Projekte!C:D,2,FALSE))","v":""}]
[null,null,null,"","",null,"","","","",null,null,null,"","","",{"$f":"IF(K67=\"\", \"\", VLOOKUP(K67,Projekte!C:D,2,FALSE))","v":""}]
[null,null,null,{"$f":"IF(C68=\"\", \"\", C68-B68)","v":""},{"$f":"IF(D68=\"\", \"\", (C68-B68)*24)","v":""},null,{"$f":"IF(K68 = selectThisProjekt,E68, \"\")","v":""},"","","",null,null,null,"","","",{"$f":"IF(K68=\"\", \"\", VLOOKUP(K68,Projekte!C:D,2,FALSE))","v":""}]
[null,null,null,"","",null,"",{"$f":"IF(F69 = \"\", G69, \"\")","v":""},{"$f":"IF(LOWER(F69) = \"r\",G69,\"\")","v":""},{"$f":"IF(AND(F69<>\"\", LOWER(F69) <> \"r\"),G69,\"\")","v":""},null,null,null,"","","",{"$f":"IF(K69=\"\", \"\", VLOOKUP(K69,Projekte!C:D,2,FALSE))","v":""}]
[null,null,null,"","",null,"","","","",null,null,null,{"$f":"IF(M70<>\"\", \"\", IF(F70 = \"\", G70, \"\"))","v":""},{"$f":"IF(M70<>\"\", \"\", IF(LOWER(F70) = \"r\",G70,\"\"))","v":""},{"$f":"IF(M70<>\"\", \"\", IF(AND(F70<>\"\", LOWER(F70) <> \"r\"),G70,\"\"))","v":""},{"$f":"IF(K70=\"\", \"\", VLOOKUP(K70,Projekte!C:D,2,FALSE))","v":""}]
[null,null,null,"","",null,"","","","",null,null,null,"","","",{"$f":"IF(K71=\"\", \"\", VLOOKUP(K71,Projekte!C:D,2,FALSE))","v":""}]
[null,null,null,"","",null,"","","","",null,null,null,"","","",{"$f":"IF(K72=\"\", \"\", VLOOKUP(K72,Projekte!C:D,2,FALSE))","v":""}]
[null,null,null,"","",null,"","","","",null,null,null,"","","",{"$f":"IF(K73=\"\", \"\", VLOOKUP(K73,Projekte!C:D,2,FALSE))","v":""}]
[null,null,null,"","",null,"","","","",null,null,null,"","","",{"$f":"IF(K74=\"\", \"\", VLOOKUP(K74,Projekte!C:D,2,FALSE))","v":""}]
[null,null,null,"","",null,"","","","",null,null,null,"","","",{"$f":"IF(K75=\"\", \"\", VLOOKUP(K75,Projekte!C:D,2,FALSE))","v":""}]
[null,null,null,"","",null,"","","","",null,null,null,"","","",{"$f":"IF(K76=\"\", \"\", VLOOKUP(K76,Projekte!C:D,2,FALSE))","v":""}]
[null,null,null,"","",null,"","","","",null,null,null,"","","",{"$f":"IF(K77=\"\", \"\", VLOOKUP(K77,Projekte!C:D,2,FALSE))","v":""}]
[null,null,null,"","",null,"","","","",null,null,null,"","","",{"$f":"IF(K78=\"\", \"\", VLOOKUP(K78,Projekte!C:D,2,FALSE))","v":""}]
[null,null,null,"","",null,"","","","",null,null,null,"","","",{"$f":"IF(K79=\"\", \"\", VLOOKUP(K79,Projekte!C:D,2,FALSE))","v":""}]
[null,null,null,"","",null,"","","","",null,null,null,"","","",{"$f":"IF(K80=\"\", \"\", VLOOKUP(K80,Projekte!C:D,2,FALSE))","v":""}]
[null,null,null,"","",null,"","","","",null,null,null,"","","",{"$f":"IF(K81=\"\", \"\", VLOOKUP(K81,Projekte!C:D,2,FALSE))","v":""}]
[null,null,null,"","",null,"","","","",null,null,null,"","","",{"$f":"IF(K82=\"\", \"\", VLOOKUP(K82,Projekte!C:D,2,FALSE))","v":""}]
[null,null,null,"","",null,"","","","",null,null,null,"","","",{"$f":"IF(K83=\"\", \"\", VLOOKUP(K83,Projekte!C:D,2,FALSE))","v":""}]
[null,null,null,"","",null,"","","","",null,null,null,"","","",{"$f":"IF(K84=\"\", \"\", VLOOKUP(K84,Projekte!C:D,2,FALSE))","v":""}]
[null,null,null,"","",null,"","","","",null,null,null,"","","",{"$f":"IF(K85=\"\", \"\", VLOOKUP(K85,Projekte!C:D,2,FALSE))","v":""}]
[null,null,null,"","",null,"","","","",null,null,null,"","","",{"$f":"IF(K86=\"\", \"\", VLOOKUP(K86,Projekte!C:D,2,FALSE))","v":""}]
[null,null,null,"","",null,"","","","",null,null,null,"","","",{"$f":"IF(K87=\"\", \"\", VLOOKUP(K87,Projekte!C:D,2,FALSE))","v":""}]
[null,null,null,"","",null,"","","","",null,null,null,"","","",{"$f":"IF(K88=\"\", \"\", VLOOKUP(K88,Projekte!C:D,2,FALSE))","v":""}]
[null,null,null,"","",null,"","","","",null,null,null,"","","",{"$f":"IF(K89=\"\", \"\", VLOOKUP(K89,Projekte!C:D,2,FALSE))","v":""}]
[null,null,null,"","",null,"","","","",null,null,null,"","","",{"$f":"IF(K90=\"\", \"\", VLOOKUP(K90,Projekte!C:D,2,FALSE))","v":""}]
[null,null,null,"","",null,"","","","",null,null,null,"","","",{"$f":"IF(K91=\"\", \"\", VLOOKUP(K91,Projekte!C:D,2,FALSE))","v":""}]
[null,null,null,"","",null,"","","","",null,null,null,"","","",{"$f":"IF(K92=\"\", \"\", VLOOKUP(K92,Projekte!C:D,2,FALSE))","v":""}]
[null,null,null,"","",null,"","","","",null,null,null,"","","",{"$f":"IF(K93=\"\", \"\", VLOOKUP(K93,Projekte!C:D,2,FALSE))","v":""}]
[null,null,null,"","",null,"","","","",null,null,null,"","","",{"$f":"IF(K94=\"\", \"\", VLOOKUP(K94,Projekte!C:D,2,FALSE))","v":""}]
[null,null,null,"","",null,"","","","",null,null,null,"","","",{"$f":"IF(K95=\"\", \"\", VLOOKUP(K95,Projekte!C:D,2,FALSE))","v":""}]
[null,null,null,"","",null,"","","","",null,null,null,"","","",{"$f":"IF(K96=\"\", \"\", VLOOKUP(K96,Projekte!C:D,2,FALSE))","v":""}]
[null,null,null,"","",null,"","","","",null,null,null,"","","",{"$f":"IF(K97=\"\", \"\", VLOOKUP(K97,Projekte!C:D,2,FALSE))","v":""}]
[null,null,null,"","",null,"","","","",null,null,null,"","","",{"$f":"IF(K98=\"\", \"\", VLOOKUP(K98,Projekte!C:D,2,FALSE))","v":""}]
[null,null,null,"","",null,"","","","",null,null,null,"","","",{"$f":"IF(K99=\"\", \"\", VLOOKUP(K99,Projekte!C:D,2,FALSE))","v":""}]
[null,null,null,"","",null,{"$f":"IF(K100 = selectThisProjekt,E100, \"\")","v":""},"","","",null,null,null,"","","",{"$f":"IF(K100=\"\", \"\", VLOOKUP(K100,Projekte!C:D,2,FALSE))","v":""}]
[null,null,null,"","",null,"","","","",null,null,null,"","","",{"$f":"IF(K101=\"\", \"\", VLOOKUP(K101,Projekte!C:D,2,FALSE))","v":""}]
[null,null,null,"","",null,"","","","",null,null,null,"","","",{"$f":"IF(K102=\"\", \"\", VLOOKUP(K102,Projekte!C:D,2,FALSE))","v":""}]
[null,null,null,"","",null,"","","","",null,null,null,"","","",{"$f":"IF(K103=\"\", \"\", VLOOKUP(K103,Projekte!C:D,2,FALSE))","v":""}]
[null,null,null,"","",null,"","","","",null,null,null,"","","",{"$f":"IF(K104=\"\", \"\", VLOOKUP(K104,Projekte!C:D,2,FALSE))","v":""}]
[null,null,null,"","",null,"","","","",null,null,null,"","","",{"$f":"IF(K105=\"\", \"\", VLOOKUP(K105,Projekte!C:D,2,FALSE))","v":""}]
[null,null,null,"","",null,"","","","",null,null,null,"","","",{"$f":"IF(K106=\"\", \"\", VLOOKUP(K106,Projekte!C:D,2,FALSE))","v":""}]
[null,null,null,"","",null,"","","","",null,null,null,"","","",{"$f":"IF(K107=\"\", \"\", VLOOKUP(K107,Projekte!C:D,2,FALSE))","v":""}]
[null,null,null,"","",null,"","","","",null,null,null,"","","",{"$f":"IF(K108=\"\", \"\", VLOOKUP(K108,Projekte!C:D,2,FALSE))","v":""}]
[null,null,null,"","",null,"","","","",null,null,null,"","","",{"$f":"IF(K109=\"\", \"\", VLOOKUP(K109,Projekte!C:D,2,FALSE))","v":""}]
[null,null,null,"","",null,"","","","",null,null,null,"","","",{"$f":"IF(K110=\"\", \"\", VLOOKUP(K110,Projekte!C:D,2,FALSE))","v":""}]
[null,null,null,"","",null,"","","","",null,null,null,"","","",{"$f":"IF(K111=\"\", \"\", VLOOKUP(K111,Projekte!C:D,2,FALSE))","v":""}]
[null,null,null,"","",null,"","","","",null,null,null,"","","",{"$f":"IF(K112=\"\", \"\", VLOOKUP(K112,Projekte!C:D,2,FALSE))","v":""}]
[null,null,null,"","",null,"","","","",null,null,null,"","","",{"$f":"IF(K113=\"\", \"\", VLOOKUP(K113,Projekte!C:D,2,FALSE))","v":""}]
[null,null,null,"","",null,"","","","",null,null,null,"","","",{"$f":"IF(K114=\"\", \"\", VLOOKUP(K114,Projekte!C:D,2,FALSE))","v":""}]
[null,null,null,"","",null,"","","","",null,null,null,"","","",{"$f":"IF(K115=\"\", \"\", VLOOKUP(K115,Projekte!C:D,2,FALSE))","v":""}]
[null,null,null,"","",null,"","","","",null,null,null,"","","",{"$f":"IF(K116=\"\", \"\", VLOOKUP(K116,Projekte!C:D,2,FALSE))","v":""}]
[null,null,null,"","",null,"","","","",null,null,null,"","","",{"$f":"IF(K117=\"\", \"\", VLOOKUP(K117,Projekte!C:D,2,FALSE))","v":""}]
[null,null,null,"","",null,"","","","",null,null,null,"","","",{"$f":"IF(K118=\"\", \"\", VLOOKUP(K118,Projekte!C:D,2,FALSE))","v":""}]
[null,null,null,"","",null,"","","","",null,null,null,"","","",{"$f":"IF(K119=\"\", \"\", VLOOKUP(K119,Projekte!C:D,2,FALSE))","v":""}]
[null,null,null,"","",null,"","","","",null,null,null,"","","",{"$f":"IF(K120=\"\", \"\", VLOOKUP(K120,Projekte!C:D,2,FALSE))","v":""}]
[null,null,null,"","",null,"","","","",null,null,null,"","","",{"$f":"IF(K121=\"\", \"\", VLOOKUP(K121,Projekte!C:D,2,FALSE))","v":""}]
[null,null,null,"","",null,"","","","",null,null,null,"","","",{"$f":"IF(K122=\"\", \"\", VLOOKUP(K122,Projekte!C:D,2,FALSE))","v":""}]
[null,null,null,"","",null,{"$f":"IF(K123 = selectThisProjekt,E123, \"\")","v":""},"","","",null,null,null,"","","",{"$f":"IF(K123=\"\", \"\", VLOOKUP(K123,Projekte!C:D,2,FALSE))","v":""}]
[null,null,null,"","",null,"","","","",null,null,null,"","","",{"$f":"IF(K124=\"\", \"\", VLOOKUP(K124,Projekte!C:D,2,FALSE))","v":""}]
[null,null,null,"","",null,{"$f":"IF(K125 = selectThisProjekt,E125, \"\")","v":""},"","","",null,null,null,"","","",{"$f":"IF(K125=\"\", \"\", VLOOKUP(K125,Projekte!C:D,2,FALSE))","v":""}]
[null,null,null,"","",null,"","","","",null,null,null,"","","",{"$f":"IF(K126=\"\", \"\", VLOOKUP(K126,Projekte!C:D,2,FALSE))","v":""}]
[null,null,null,"","",null,"","","","",null,null,null,"","","",{"$f":"IF(K127=\"\", \"\", VLOOKUP(K127,Projekte!C:D,2,FALSE))","v":""}]
[null,null,null,"","",null,"","","","",null,null,null,"","","",{"$f":"IF(K128=\"\", \"\", VLOOKUP(K128,Projekte!C:D,2,FALSE))","v":""}]
[null,null,null,"","",null,"","","","",null,null,null,"","","",{"$f":"IF(K129=\"\", \"\", VLOOKUP(K129,Projekte!C:D,2,FALSE))","v":""}]
[null,null,null,"","",null,"","","","",null,null,null,"","","",{"$f":"IF(K130=\"\", \"\", VLOOKUP(K130,Projekte!C:D,2,FALSE))","v":""}]
[null,null,null,"","",null,"","","","",null,null,null,"","","",{"$f":"IF(K131=\"\", \"\", VLOOKUP(K131,Projekte!C:D,2,FALSE))","v":""}]
[null,null,null,{"$f":"IF(C132=\"\", \"\", C132-B132)","v":""},{"$f":"IF(D132=\"\", \"\", (C132-B132)*24)","v":""},null,{"$f":"IF(K132 = selectThisProjekt,E132, \"\")","v":""},"","","",null,null,null,"","","",{"$f":"IF(K132=\"\", \"\", VLOOKUP(K132,Projekte!C:D,2,FALSE))","v":""}]
[null,null,null,"","",null,"",{"$f":"IF(F133 = \"\", G133, \"\")","v":""},{"$f":"IF(LOWER(F133) = \"r\",G133,\"\")","v":""},{"$f":"IF(AND(F133<>\"\", LOWER(F133) <> \"r\"),G133,\"\")","v":""},null,null,null,"","","",{"$f":"IF(K133=\"\", \"\", VLOOKUP(K133,Projekte!C:D,2,FALSE))","v":""}]
[null,null,null,"","",null,"","","","",null,null,null,{"$f":"IF(M134<>\"\", \"\", IF(F134 = \"\", G134, \"\"))","v":""},{"$f":"IF(M134<>\"\", \"\", IF(LOWER(F134) = \"r\",G134,\"\"))","v":""},{"$f":"IF(M134<>\"\", \"\", IF(AND(F134<>\"\", LOWER(F134) <> \"r\"),G134,\"\"))","v":""},{"$f":"IF(K134=\"\", \"\", VLOOKUP(K134,Projekte!C:D,2,FALSE))","v":""}]
[null,null,null,"","",null,"","","","",null,null,null,"","","",{"$f":"IF(K135=\"\", \"\", VLOOKUP(K135,Projekte!C:D,2,FALSE))","v":""}]
[null,null,null,"","",null,"","","","",null,null,null,"","","",{"$f":"IF(K136=\"\", \"\", VLOOKUP(K136,Projekte!C:D,2,FALSE))","v":""}]
[null,null,null,"","",null,"","","","",null,null,null,"","","",{"$f":"IF(K137=\"\", \"\", VLOOKUP(K137,Projekte!C:D,2,FALSE))","v":""}]
[null,null,null,"","",null,"","","","",null,null,null,"","","",{"$f":"IF(K138=\"\", \"\", VLOOKUP(K138,Projekte!C:D,2,FALSE))","v":""}]
[null,null,null,"","",null,"","","","",null,null,null,"","","",{"$f":"IF(K139=\"\", \"\", VLOOKUP(K139,Projekte!C:D,2,FALSE))","v":""}]
[null,null,null,"","",null,"","","","",null,null,null,"","","",{"$f":"IF(K140=\"\", \"\", VLOOKUP(K140,Projekte!C:D,2,FALSE))","v":""}]
[null,null,null,"","",null,"","","","",null,null,null,"","","",{"$f":"IF(K141=\"\", \"\", VLOOKUP(K141,Projekte!C:D,2,FALSE))","v":""}]
[null,null,null,"","",null,"","","","",null,null,null,"","","",{"$f":"IF(K142=\"\", \"\", VLOOKUP(K142,Projekte!C:D,2,FALSE))","v":""}]
[null,null,null,"","",null,"","","","",null,null,null,"","","",{"$f":"IF(K143=\"\", \"\", VLOOKUP(K143,Projekte!C:D,2,FALSE))","v":""}]
[null,null,null,"","",null,"","","","",null,null,null,"","","",{"$f":"IF(K144=\"\", \"\", VLOOKUP(K144,Projekte!C:D,2,FALSE))","v":""}]
[null,null,null,"","",null,"","","","",null,null,null,"","","",{"$f":"IF(K145=\"\", \"\", VLOOKUP(K145,Projekte!C:D,2,FALSE))","v":""}]
[null,null,null,"","",null,"","","","",null,null,null,"","","",{"$f":"IF(K146=\"\", \"\", VLOOKUP(K146,Projekte!C:D,2,FALSE))","v":""}]
[null,null,null,"","",null,"","","","",null,null,null,"","","",{"$f":"IF(K147=\"\", \"\", VLOOKUP(K147,Projekte!C:D,2,FALSE))","v":""}]
[null,null,null,"","",null,"","","","",null,null,null,"","","",{"$f":"IF(K148=\"\", \"\", VLOOKUP(K148,Projekte!C:D,2,FALSE))","v":""}]
[null,null,null,"","",null,"","","","",null,null,null,"","","",{"$f":"IF(K149=\"\", \"\", VLOOKUP(K149,Projekte!C:D,2,FALSE))","v":""}]
[null,null,null,"","",null,"","","","",null,null,null,"","","",{"$f":"IF(K150=\"\", \"\", VLOOKUP(K150,Projekte!C:D,2,FALSE))","v":""}]
[null,null,null,"","",null,"","","","",null,null,null,"","","",{"$f":"IF(K151=\"\", \"\", VLOOKUP(K151,Projekte!C:D,2,FALSE))","v":""}]
[null,null,null,"","",null,"","","","",null,null,null,"","","",{"$f":"IF(K152=\"\", \"\", VLOOKUP(K152,Projekte!C:D,2,FALSE))","v":""}]
[null,null,null,"","",null,"","","","",null,null,null,"","","",{"$f":"IF(K153=\"\", \"\", VLOOKUP(K153,Projekte!C:D,2,FALSE))","v":""}]
[null,null,null,"","",null,"","","","",null,null,null,"","","",{"$f":"IF(K154=\"\", \"\", VLOOKUP(K154,Projekte!C:D,2,FALSE))","v":""}]
[null,null,null,"","",null,"","","","",null,null,null,"","","",{"$f":"IF(K155=\"\", \"\", VLOOKUP(K155,Projekte!C:D,2,FALSE))","v":""}]
[null,null,null,"","",null,"","","","",null,null,null,"","","",{"$f":"IF(K156=\"\", \"\", VLOOKUP(K156,Projekte!C:D,2,FALSE))","v":""}]
[null,null,null,"","",null,"","","","",null,null,null,"","","",{"$f":"IF(K157=\"\", \"\", VLOOKUP(K157,Projekte!C:D,2,FALSE))","v":""}]
[null,null,null,"","",null,"","","","",null,null,null,"","","",{"$f":"IF(K158=\"\", \"\", VLOOKUP(K158,Projekte!C:D,2,FALSE))","v":""}]
[null,null,null,"","",null,"","","","",null,null,null,"","","",{"$f":"IF(K159=\"\", \"\", VLOOKUP(K159,Projekte!C:D,2,FALSE))","v":""}]
[null,null,null,"","",null,"","","","",null,null,null,"","","",{"$f":"IF(K160=\"\", \"\", VLOOKUP(K160,Projekte!C:D,2,FALSE))","v":""}]
[null,null,null,"","",null,"","","","",null,null,null,"","","",{"$f":"IF(K161=\"\", \"\", VLOOKUP(K161,Projekte!C:D,2,FALSE))","v":""}]
[null,null,null,"","",null,"","","","",null,null,null,"","","",{"$f":"IF(K162=\"\", \"\", VLOOKUP(K162,Projekte!C:D,2,FALSE))","v":""}]
[null,null,null,"","",null,"","","","",null,null,null,"","","",{"$f":"IF(K163=\"\", \"\", VLOOKUP(K163,Projekte!C:D,2,FALSE))","v":""}]
[null,null,null,"","",null,{"$f":"IF(K164 = selectThisProjekt,E164, \"\")","v":""},"","","",null,null,null,"","","",{"$f":"IF(K164=\"\", \"\", VLOOKUP(K164,Projekte!C:D,2,FALSE))","v":""}]
[null,null,null,"","",null,"","","","",null,null,null,"","","",{"$f":"IF(K165=\"\", \"\", VLOOKUP(K165,Projekte!C:D,2,FALSE))","v":""}]
[null,null,null,"","",null,"","","","",null,null,null,"","","",{"$f":"IF(K166=\"\", \"\", VLOOKUP(K166,Projekte!C:D,2,FALSE))","v":""}]
[null,null,null,"","",null,"","","","",null,null,null,"","","",{"$f":"IF(K167=\"\", \"\", VLOOKUP(K167,Projekte!C:D,2,FALSE))","v":""}]
[null,null,null,"","",null,"","","","",null,null,null,"","","",{"$f":"IF(K168=\"\", \"\", VLOOKUP(K168,Projekte!C:D,2,FALSE))","v":""}]
[null,null,null,"","",null,"","","","",null,null,null,"","","",{"$f":"IF(K169=\"\", \"\", VLOOKUP(K169,Projekte!C:D,2,FALSE))","v":""}]
[null,null,null,"","",null,{"$f":"IF(K170 = selectThisProjekt,E170, \"\")","v":""},"","","",null,null,null,"","","",{"$f":"IF(K170=\"\", \"\", VLOOKUP(K170,Projekte!C:D,2,FALSE))","v":""}]
[null,null,null,"","",null,"","","","",null,null,null,"","","",{"$f":"IF(K171=\"\", \"\", VLOOKUP(K171,Projekte!C:D,2,FALSE))","v":""}]
[null,null,null,"","",null,"","","","",null,null,null,"","","",{"$f":"IF(K172=\"\", \"\", VLOOKUP(K172,Projekte!C:D,2,FALSE))","v":""}]
[null,null,null,"","",null,"","","","",null,null,null,"","","",{"$f":"IF(K173=\"\", \"\", VLOOKUP(K173,Projekte!C:D,2,FALSE))","v":""}]
[null,null,null,"","",null,"","","","",null,null,null,"","","",{"$f":"IF(K174=\"\", \"\", VLOOKUP(K174,Projekte!C:D,2,FALSE))","v":""}]
[null,null,null,"","",null,"","","","",null,null,null,"","","",{"$f":"IF(K175=\"\", \"\", VLOOKUP(K175,Projekte!C:D,2,FALSE))","v":""}]
[null,null,null,"","",null,"","","","",null,null,null,"","","",{"$f":"IF(K176=\"\", \"\", VLOOKUP(K176,Projekte!C:D,2,FALSE))","v":""}]
[null,null,null,"","",null,"","","","",null,null,null,"","","",{"$f":"IF(K177=\"\", \"\", VLOOKUP(K177,Projekte!C:D,2,FALSE))","v":""}]
[null,null,null,"","",null,"","","","",null,null,null,"","","",{"$f":"IF(K178=\"\", \"\", VLOOKUP(K178,Projekte!C:D,2,FALSE))","v":""}]
[null,null,null,"","",null,"","","","",null,null,null,"","","",{"$f":"IF(K179=\"\", \"\", VLOOKUP(K179,Projekte!C:D,2,FALSE))","v":""}]
[null,null,null,"","",null,"","","","",null,null,null,"","","",{"$f":"IF(K180=\"\", \"\", VLOOKUP(K180,Projekte!C:D,2,FALSE))","v":""}]
[null,null,null,"","",null,"","","","",null,null,null,"","","",{"$f":"IF(K181=\"\", \"\", VLOOKUP(K181,Projekte!C:D,2,FALSE))","v":""}]
[null,null,null,"","",null,"","","","",null,null,null,"","","",{"$f":"IF(K182=\"\", \"\", VLOOKUP(K182,Projekte!C:D,2,FALSE))","v":""}]
[null,null,null,"","",null,"","","","",null,null,null,"","","",{"$f":"IF(K183=\"\", \"\", VLOOKUP(K183,Projekte!C:D,2,FALSE))","v":""}]
[null,null,null,"","",null,"","","","",null,null,null,"","","",{"$f":"IF(K184=\"\", \"\", VLOOKUP(K184,Projekte!C:D,2,FALSE))","v":""}]
[null,null,null,"","",null,"","","","",null,null,null,"","","",{"$f":"IF(K185=\"\", \"\", VLOOKUP(K185,Projekte!C:D,2,FALSE))","v":""}]
[null,null,null,"","",null,"","","","",null,null,null,"","","",{"$f":"IF(K186=\"\", \"\", VLOOKUP(K186,Projekte!C:D,2,FALSE))","v":""}]
[null,null,null,"","",null,"","","","",null,null,null,"","","",{"$f":"IF(K187=\"\", \"\", VLOOKUP(K187,Projekte!C:D,2,FALSE))","v":""}]
[null,null,null,"","",null,"","","","",null,null,null,"","","",{"$f":"IF(K188=\"\", \"\", VLOOKUP(K188,Projekte!C:D,2,FALSE))","v":""}]
[null,null,null,"","",null,"","","","",null,null,null,"","","",{"$f":"IF(K189=\"\", \"\", VLOOKUP(K189,Projekte!C:D,2,FALSE))","v":""}]
[null,null,null,"","",null,"","","","",null,null,null,"","","",{"$f":"IF(K190=\"\", \"\", VLOOKUP(K190,Projekte!C:D,2,FALSE))","v":""}]
[null,null,null,"","",null,"","","","",null,null,null,"","","",{"$f":"IF(K191=\"\", \"\", VLOOKUP(K191,Projekte!C:D,2,FALSE))","v":""}]
[null,null,null,"","",null,"","","","",null,null,null,"","","",{"$f":"IF(K192=\"\", \"\", VLOOKUP(K192,Projekte!C:D,2,FALSE))","v":""}]
[null,null,null,"","",null,"","","","",null,null,null,"","","",{"$f":"IF(K193=\"\", \"\", VLOOKUP(K193,Projekte!C:D,2,FALSE))","v":""}]
[null,null,null,"","",null,"","","","",null,null,null,"","","",{"$f":"IF(K194=\"\", \"\", VLOOKUP(K194,Projekte!C:D,2,FALSE))","v":""}]
[null,null,null,"","",null,"","","","",null,null,null,"","","",{"$f":"IF(K195=\"\", \"\", VLOOKUP(K195,Projekte!C:D,2,FALSE))","v":""}]
[null,null,null,"","",null,"","","","",null,null,null,"","","",{"$f":"IF(K196=\"\", \"\", VLOOKUP(K196,Projekte!C:D,2,FALSE))","v":""}]
[null,null,null,"","",null,"","","","",null,null,null,"","","",{"$f":"IF(K197=\"\", \"\", VLOOKUP(K197,Projekte!C:D,2,FALSE))","v":""}]
[null,null,null,"","",null,"","","","",null,null,null,{"$f":"IF(M198<>\"\", \"\", IF(F198 = \"\", G198, \"\"))","v":""},{"$f":"IF(M198<>\"\", \"\", IF(LOWER(F198) = \"r\",G198,\"\"))","v":""},{"$f":"IF(M198<>\"\", \"\", IF(AND(F198<>\"\", LOWER(F198) <> \"r\"),G198,\"\"))","v":""},{"$f":"IF(K198=\"\", \"\", VLOOKUP(K198,Projekte!C:D,2,FALSE))","v":""}]
[null,null,null,"","",null,"","","","",null,null,null,"","","",{"$f":"IF(K199=\"\", \"\", VLOOKUP(K199,Projekte!C:D,2,FALSE))","v":""}]
[null,null,null,"","",null,"","","","",null,null,null,"","","",{"$f":"IF(K200=\"\", \"\", VLOOKUP(K200,Projekte!C:D,2,FALSE))","v":""}]
[null,null,null,"","",null,"","","","",null,null,null,"","","",{"$f":"IF(K201=\"\", \"\", VLOOKUP(K201,Projekte!C:D,2,FALSE))","v":""}]
[null,null,null,"","",null,"","","","",null,null,null,"","","",{"$f":"IF(K202=\"\", \"\", VLOOKUP(K202,Projekte!C:D,2,FALSE))","v":""}]
[null,null,null,"","",null,{"$f":"IF(K203 = selectThisProjekt,E203, \"\")","v":""},"","","",null,null,null,"","","",{"$f":"IF(K203=\"\", \"\", VLOOKUP(K203,Projekte!C:D,2,FALSE))","v":""}]
[null,null,null,"<Ende Formeln>"]

{"sheet":"Mar","index":3,"n_rows":204,"n_cols":17,"rows_kept":204,"cut":false,"hidden":false,"merged":[[0,13,0,15],[2,0,2,2]]}
[null,null,"DL-Zeiten von",{"$f":"AssignedToCfg","v":{"$error":"#REF!"}},null,null,null,null,null,null,null,null,null,"Faktura nicht erfasst"]
["Datum","Beginn","Ende","h","h,xx","r: Reise, \nx: nicht berechnen","Summe","Dienstleistung","Reise","nicht berechnen",null,"Tätigkeit","Faktura erfasst","Dienstleistung","Reise","nicht berechnen","Projektname"]
[null,null,null,null,null,"Summe",{"$f":"SUM(G4:G203)","v":0},{"$f":"SUM(H4:H203)","v":0},{"$f":"SUM(I4:I203)","v":0},{"$f":"SUM(J4:J203)","v":0},null,"<- für diesen ProjektBereich",null,{"$f":"SUM(N4:N203)","v":0},{"$f":"SUM(O4:O203)","v":0},{"$f":"SUM(P4:P203)","v":0}]
[null,null,null,{"$f":"IF(C4=\"\", \"\", C4-B4)","v":""},{"$f":"IF(D4=\"\", \"\", (C4-B4)*24)","v":""},null,{"$f":"IF(K4 = selectThisProjekt,E4, \"\")","v":""},{"$f":"IF(F4 = \"\", G4, \"\")","v":""},{"$f":"IF(LOWER(F4) = \"r\",G4,\"\")","v":""},{"$f":"IF(AND(F4<>\"\", LOWER(F4) <> \"r\"),G4,\"\")","v":""},null,null,null,{"$f":"IF(M4<>\"\", \"\", IF(F4 = \"\", G4, \"\"))","v":""},{"$f":"IF(M4<>\"\", \"\", IF(LOWER(F4) = \"r\",G4,\"\"))","v":""},{"$f":"IF(M4<>\"\", \"\", IF(AND(F4<>\"\", LOWER(F4) <> \"r\"),G4,\"\"))","v":""},{"$f":"IF(K4=\"\", \"\", VLOOKUP(K4,Projekte!C:D,2,FALSE))","v":""}]
[null,null,null,"","",null,"",{"$f":"IF(F5 = \"\", G5, \"\")","v":""},{"$f":"IF(LOWER(F5) = \"r\",G5,\"\")","v":""},{"$f":"IF(AND(F5<>\"\", LOWER(F5) <> \"r\"),G5,\"\")","v":""},null,null,null,{"$f":"IF(M5<>\"\", \"\", IF(F5 = \"\", G5, \"\"))","v":""},{"$f":"IF(M5<>\"\", \"\", IF(LOWER(F5) = \"r\",G5,\"\"))","v":""},{"$f":"IF(M5<>\"\", \"\", IF(AND(F5<>\"\", LOWER(F5) <> \"r\"),G5,\"\"))","v":""},{"$f":"IF(K5=\"\", \"\", VLOOKUP(K5,Projekte!C:D,2,FALSE))","v":""}]
[null,null,null,"","",null,"","","","",null,null,null,{"$f":"IF(M6<>\"\", \"\", IF(F6 = \"\", G6, \"\"))","v":""},{"$f":"IF(M6<>\"\", \"\", IF(LOWER(F6) = \"r\",G6,\"\"))","v":""},{"$f":"IF(M6<>\"\", \"\", IF(AND(F6<>\"\", LOWER(F6) <> \"r\"),G6,\"\"))","v":""},{"$f":"IF(K6=\"\", \"\", VLOOKUP(K6,Projekte!C:D,2,FALSE))","v":""}]
[null,null,null,"","",null,"","","","",null,null,null,"","","",{"$f":"IF(K7=\"\", \"\", VLOOKUP(K7,Projekte!C:D,2,FALSE))","v":""}]
[null,null,null,"","",null,"","","","",null,null,null,"","","",{"$f":"IF(K8=\"\", \"\", VLOOKUP(K8,Projekte!C:D,2,FALSE))","v":""}]
[null,null,null,"","",null,"","","","",null,null,null,"","","",{"$f":"IF(K9=\"\", \"\", VLOOKUP(K9,Projekte!C:D,2,FALSE))","v":""}]
[null,null,null,"","",null,"","","","",null,null,null,"","","",{"$f":"IF(K10=\"\", \"\", VLOOKUP(K10,Projekte!C:D,2,FALSE))","v":""}]
[null,null,null,"","",null,"","","","",null,null,null,"","","",{"$f":"IF(K11=\"\", \"\", VLOOKUP(K11,Projekte!C:D,2,FALSE))","v":""}]
[null,null,null,"","",null,"","","","",null,null,null,"","","",{"$f":"IF(K12=\"\", \"\", VLOOKUP(K12,Projekte!C:D,2,FALSE))","v":""}]
[null,null,null,"","",null,"","","","",null,null,null,"","","",{"$f":"IF(K13=\"\", \"\", VLOOKUP(K13,Projekte!C:D,2,FALSE))","v":""}]
[null,null,null,"","",null,"","","","",null,null,null,"","","",{"$f":"IF(K14=\"\", \"\", VLOOKUP(K14,Projekte!C:D,2,FALSE))","v":""}]
[null,null,null,"","",null,"","","","",null,null,null,"","","",{"$f":"IF(K15=\"\", \"\", VLOOKUP(K15,Projekte!C:D,2,FALSE))","v":""}]
[null,null,null,"","",null,"","","","",null,null,null,"","","",{"$f":"IF(K16=\"\", \"\", VLOOKUP(K16,Projekte!C:D,2,FALSE))","v":""}]
[null,null,null,"","",null,"","","","",null,null,null,"","","",{"$f":"IF(K17=\"\", \"\", VLOOKUP(K17,Projekte!C:D,2,FALSE))","v":""}]
[null,null,null,"","",null,"","","","",null,null,null,"","","",{"$f":"IF(K18=\"\", \"\", VLOOKUP(K18,Projekte!C:D,2,FALSE))","v":""}]
[null,null,null,"","",null,"","","","",null,null,null,"","","",{"$f":"IF(K19=\"\", \"\", VLOOKUP(K19,Projekte!C:D,2,FALSE))","v":""}]
[null,null,null,"","",null,"","","","",null,null,null,"","","",{"$f":"IF(K20=\"\", \"\", VLOOKUP(K20,Projekte!C:D,2,FALSE))","v":""}]
[null,null,null,"","",null,"","","","",null,null,null,"","","",{"$f":"IF(K21=\"\", \"\", VLOOKUP(K21,Projekte!C:D,2,FALSE))","v":""}]
[null,null,null,"","",null,"","","","",null,null,null,"","","",{"$f":"IF(K22=\"\", \"\", VLOOKUP(K22,Projekte!C:D,2,FALSE))","v":""}]
[null,null,null,"","",null,"","","","",null,null,null,"","","",{"$f":"IF(K23=\"\", \"\", VLOOKUP(K23,Projekte!C:D,2,FALSE))","v":""}]
[null,null,null,"","",null,"","","","",null,null,null,"","","",{"$f":"IF(K24=\"\", \"\", VLOOKUP(K24,Projekte!C:D,2,FALSE))","v":""}]
[null,null,null,"","",null,"","","","",null,null,null,"","","",{"$f":"IF(K25=\"\", \"\", VLOOKUP(K25,Projekte!C:D,2,FALSE))","v":""}]
[null,null,null,"","",null,"","","","",null,null,null,"","","",{"$f":"IF(K26=\"\", \"\", VLOOKUP(K26,Projekte!C:D,2,FALSE))","v":""}]
[null,null,null,"","",null,"","","","",null,null,null,"","","",{"$f":"IF(K27=\"\", \"\", VLOOKUP(K27,Projekte!C:D,2,FALSE))","v":""}]
[null,null,null,"","",null,"","","","",null,null,null,"","","",{"$f":"IF(K28=\"\", \"\", VLOOKUP(K28,Projekte!C:D,2,FALSE))","v":""}]
[null,null,null,"","",null,"","","","",null,null,null,"","","",{"$f":"IF(K29=\"\", \"\", VLOOKUP(K29,Projekte!C:D,2,FALSE))","v":""}]
[null,null,null,"","",null,"","","","",null,null,null,"","","",{"$f":"IF(K30=\"\", \"\", VLOOKUP(K30,Projekte!C:D,2,FALSE))","v":""}]
[null,null,null,"","",null,"","","","",null,null,null,"","","",{"$f":"IF(K31=\"\", \"\", VLOOKUP(K31,Projekte!C:D,2,FALSE))","v":""}]
[null,null,null,"","",null,"","","","",null,null,null,"","","",{"$f":"IF(K32=\"\", \"\", VLOOKUP(K32,Projekte!C:D,2,FALSE))","v":""}]
[null,null,null,"","",null,"","","","",null,null,null,"","","",{"$f":"IF(K33=\"\", \"\", VLOOKUP(K33,Projekte!C:D,2,FALSE))","v":""}]
[null,null,null,"","",null,"","","","",null,null,null,"","","",{"$f":"IF(K34=\"\", \"\", VLOOKUP(K34,Projekte!C:D,2,FALSE))","v":""}]
[null,null,null,"","",null,"","","","",null,null,null,"","","",{"$f":"IF(K35=\"\", \"\", VLOOKUP(K35,Projekte!C:D,2,FALSE))","v":""}]
[null,null,null,"","",null,{"$f":"IF(K36 = selectThisProjekt,E36, \"\")","v":""},"","","",null,null,null,"","","",{"$f":"IF(K36=\"\", \"\", VLOOKUP(K36,Projekte!C:D,2,FALSE))","v":""}]
[null,null,null,"","",null,"","","","",null,null,null,"","","",{"$f":"IF(K37=\"\", \"\", VLOOKUP(K37,Projekte!C:D,2,FALSE))","v":""}]
[null,null,null,"","",null,"","","","",null,null,null,"","","",{"$f":"IF(K38=\"\", \"\", VLOOKUP(K38,Projekte!C:D,2,FALSE))","v":""}]
[null,null,null,"","",null,"","","","",null,null,null,"","","",{"$f":"IF(K39=\"\", \"\", VLOOKUP(K39,Projekte!C:D,2,FALSE))","v":""}]
[null,null,null,"","",null,"","","","",null,null,null,"","","",{"$f":"IF(K40=\"\", \"\", VLOOKUP(K40,Projekte!C:D,2,FALSE))","v":""}]
[null,null,null,"","",null,"","","","",null,null,null,"","","",{"$f":"IF(K41=\"\", \"\", VLOOKUP(K41,Projekte!C:D,2,FALSE))","v":""}]
[null,null,null,"","",null,"","","","",null,null,null,"","","",{"$f":"IF(K42=\"\", \"\", VLOOKUP(K42,Projekte!C:D,2,FALSE))","v":""}]
[null,null,null,"","",null,"","","","",null,null,null,"","","",{"$f":"IF(K43=\"\", \"\", VLOOKUP(K43,Projekte!C:D,2,FALSE))","v":""}]
[null,null,null,"","",null,"","","","",null,null,null,"","","",{"$f":"IF(K44=\"\", \"\", VLOOKUP(K44,Projekte!C:D,2,FALSE))","v":""}]
[null,null,null,"","",null,"","","","",null,null,null,"","","",{"$f":"IF(K45=\"\", \"\", VLOOKUP(K45,Projekte!C:D,2,FALSE))","v":""}]
[null,null,null,"","",null,"","","","",null,null,null,"","","",{"$f":"IF(K46=\"\", \"\", VLOOKUP(K46,Projekte!C:D,2,FALSE))","v":""}]
[null,null,null,"","",null,"","","","",null,null,null,"","","",{"$f":"IF(K47=\"\", \"\", VLOOKUP(K47,Projekte!C:D,2,FALSE))","v":""}]
[null,null,null,"","",null,"","","","",null,null,null,"","","",{"$f":"IF(K48=\"\", \"\", VLOOKUP(K48,Projekte!C:D,2,FALSE))","v":""}]
[null,null,null,"","",null,"","","","",null,null,null,"","","",{"$f":"IF(K49=\"\", \"\", VLOOKUP(K49,Projekte!C:D,2,FALSE))","v":""}]
[null,null,null,"","",null,"","","","",null,null,null,"","","",{"$f":"IF(K50=\"\", \"\", VLOOKUP(K50,Projekte!C:D,2,FALSE))","v":""}]
[null,null,null,"","",null,"","","","",null,null,null,"","","",{"$f":"IF(K51=\"\", \"\", VLOOKUP(K51,Projekte!C:D,2,FALSE))","v":""}]
[null,null,null,"","",null,"","","","",null,null,null,"","","",{"$f":"IF(K52=\"\", \"\", VLOOKUP(K52,Projekte!C:D,2,FALSE))","v":""}]
[null,null,null,"","",null,"","","","",null,null,null,"","","",{"$f":"IF(K53=\"\", \"\", VLOOKUP(K53,Projekte!C:D,2,FALSE))","v":""}]
[null,null,null,"","",null,"","","","",null,null,null,"","","",{"$f":"IF(K54=\"\", \"\", VLOOKUP(K54,Projekte!C:D,2,FALSE))","v":""}]
[null,null,null,"","",null,"","","","",null,null,null,"","","",{"$f":"IF(K55=\"\", \"\", VLOOKUP(K55,Projekte!C:D,2,FALSE))","v":""}]
[null,null,null,"","",null,"","","","",null,null,null,"","","",{"$f":"IF(K56=\"\", \"\", VLOOKUP(K56,Projekte!C:D,2,FALSE))","v":""}]
[null,null,null,"","",null,"","","","",null,null,null,"","","",{"$f":"IF(K57=\"\", \"\", VLOOKUP(K57,Projekte!C:D,2,FALSE))","v":""}]
[null,null,null,"","",null,"","","","",null,null,null,"","","",{"$f":"IF(K58=\"\", \"\", VLOOKUP(K58,Projekte!C:D,2,FALSE))","v":""}]
[null,null,null,"","",null,"","","","",null,null,null,"","","",{"$f":"IF(K59=\"\", \"\", VLOOKUP(K59,Projekte!C:D,2,FALSE))","v":""}]
[null,null,null,"","",null,"","","","",null,null,null,"","","",{"$f":"IF(K60=\"\", \"\", VLOOKUP(K60,Projekte!C:D,2,FALSE))","v":""}]
[null,null,null,"","",null,"","","","",null,null,null,"","","",{"$f":"IF(K61=\"\", \"\", VLOOKUP(K61,Projekte!C:D,2,FALSE))","v":""}]
[null,null,null,"","",null,"","","","",null,null,null,"","","",{"$f":"IF(K62=\"\", \"\", VLOOKUP(K62,Projekte!C:D,2,FALSE))","v":""}]
[null,null,null,"","",null,"","","","",null,null,null,"","","",{"$f":"IF(K63=\"\", \"\", VLOOKUP(K63,Projekte!C:D,2,FALSE))","v":""}]
[null,null,null,"","",null,"","","","",null,null,null,"","","",{"$f":"IF(K64=\"\", \"\", VLOOKUP(K64,Projekte!C:D,2,FALSE))","v":""}]
[null,null,null,"","",null,"","","","",null,null,null,"","","",{"$f":"IF(K65=\"\", \"\", VLOOKUP(K65,Projekte!C:D,2,FALSE))","v":""}]
[null,null,null,"","",null,"","","","",null,null,null,"","","",{"$f":"IF(K66=\"\", \"\", VLOOKUP(K66,Projekte!C:D,2,FALSE))","v":""}]
[null,null,null,"","",null,"","","","",null,null,null,"","","",{"$f":"IF(K67=\"\", \"\", VLOOKUP(K67,Projekte!C:D,2,FALSE))","v":""}]
[null,null,null,{"$f":"IF(C68=\"\", \"\", C68-B68)","v":""},{"$f":"IF(D68=\"\", \"\", (C68-B68)*24)","v":""},null,{"$f":"IF(K68 = selectThisProjekt,E68, \"\")","v":""},"","","",null,null,null,"","","",{"$f":"IF(K68=\"\", \"\", VLOOKUP(K68,Projekte!C:D,2,FALSE))","v":""}]
[null,null,null,"","",null,"",{"$f":"IF(F69 = \"\", G69, \"\")","v":""},{"$f":"IF(LOWER(F69) = \"r\",G69,\"\")","v":""},{"$f":"IF(AND(F69<>\"\", LOWER(F69) <> \"r\"),G69,\"\")","v":""},null,null,null,"","","",{"$f":"IF(K69=\"\", \"\", VLOOKUP(K69,Projekte!C:D,2,FALSE))","v":""}]
[null,null,null,"","",null,"","","","",null,null,null,{"$f":"IF(M70<>\"\", \"\", IF(F70 = \"\", G70, \"\"))","v":""},{"$f":"IF(M70<>\"\", \"\", IF(LOWER(F70) = \"r\",G70,\"\"))","v":""},{"$f":"IF(M70<>\"\", \"\", IF(AND(F70<>\"\", LOWER(F70) <> \"r\"),G70,\"\"))","v":""},{"$f":"IF(K70=\"\", \"\", VLOOKUP(K70,Projekte!C:D,2,FALSE))","v":""}]
[null,null,null,"","",null,"","","","",null,null,null,"","","",{"$f":"IF(K71=\"\", \"\", VLOOKUP(K71,Projekte!C:D,2,FALSE))","v":""}]
[null,null,null,"","",null,"","","","",null,null,null,"","","",{"$f":"IF(K72=\"\", \"\", VLOOKUP(K72,Projekte!C:D,2,FALSE))","v":""}]
[null,null,null,"","",null,"","","","",null,null,null,"","","",{"$f":"IF(K73=\"\", \"\", VLOOKUP(K73,Projekte!C:D,2,FALSE))","v":""}]
[null,null,null,"","",null,"","","","",null,null,null,"","","",{"$f":"IF(K74=\"\", \"\", VLOOKUP(K74,Projekte!C:D,2,FALSE))","v":""}]
[null,null,null,"","",null,"","","","",null,null,null,"","","",{"$f":"IF(K75=\"\", \"\", VLOOKUP(K75,Projekte!C:D,2,FALSE))","v":""}]
[null,null,null,"","",null,"","","","",null,null,null,"","","",{"$f":"IF(K76=\"\", \"\", VLOOKUP(K76,Projekte!C:D,2,FALSE))","v":""}]
[null,null,null,"","",null,"","","","",null,null,null,"","","",{"$f":"IF(K77=\"\", \"\", VLOOKUP(K77,Projekte!C:D,2,FALSE))","v":""}]
[null,null,null,"","",null,"","","","",null,null,null,"","","",{"$f":"IF(K78=\"\", \"\", VLOOKUP(K78,Projekte!C:D,2,FALSE))","v":""}]
[null,null,null,"","",null,"","","","",null,null,null,"","","",{"$f":"IF(K79=\"\", \"\", VLOOKUP(K79,Projekte!C:D,2,FALSE))","v":""}]
[null,null,null,"","",null,"","","","",null,null,null,"","","",{"$f":"IF(K80=\"\", \"\", VLOOKUP(K80,Projekte!C:D,2,FALSE))","v":""}]
[null,null,null,"","",null,"","","","",null,null,null,"","","",{"$f":"IF(K81=\"\", \"\", VLOOKUP(K81,Projekte!C:D,2,FALSE))","v":""}]
[null,null,null,"","",null,"","","","",null,null,null,"","","",{"$f":"IF(K82=\"\", \"\", VLOOKUP(K82,Projekte!C:D,2,FALSE))","v":""}]
[null,null,null,"","",null,"","","","",null,null,null,"","","",{"$f":"IF(K83=\"\", \"\", VLOOKUP(K83,Projekte!C:D,2,FALSE))","v":""}]
[null,null,null,"","",null,"","","","",null,null,null,"","","",{"$f":"IF(K84=\"\", \"\", VLOOKUP(K84,Projekte!C:D,2,FALSE))","v":""}]
[null,null,null,"","",null,"","","","",null,null,null,"","","",{"$f":"IF(K85=\"\", \"\", VLOOKUP(K85,Projekte!C:D,2,FALSE))","v":""}]
[null,null,null,"","",null,"","","","",null,null,null,"","","",{"$f":"IF(K86=\"\", \"\", VLOOKUP(K86,Projekte!C:D,2,FALSE))","v":""}]
[null,null,null,"","",null,"","","","",null,null,null,"","","",{"$f":"IF(K87=\"\", \"\", VLOOKUP(K87,Projekte!C:D,2,FALSE))","v":""}]
[null,null,null,"","",null,"","","","",null,null,null,"","","",{"$f":"IF(K88=\"\", \"\", VLOOKUP(K88,Projekte!C:D,2,FALSE))","v":""}]
[null,null,null,"","",null,"","","","",null,null,null,"","","",{"$f":"IF(K89=\"\", \"\", VLOOKUP(K89,Projekte!C:D,2,FALSE))","v":""}]
[null,null,null,"","",null,"","","","",null,null,null,"","","",{"$f":"IF(K90=\"\", \"\", VLOOKUP(K90,Projekte!C:D,2,FALSE))","v":""}]
[null,null,null,"","",null,"","","","",null,null,null,"","","",{"$f":"IF(K91=\"\", \"\", VLOOKUP(K91,Projekte!C:D,2,FALSE))","v":""}]
[null,null,null,"","",null,"","","","",null,null,null,"","","",{"$f":"IF(K92=\"\", \"\", VLOOKUP(K92,Projekte!C:D,2,FALSE))","v":""}]
[null,null,null,"","",null,"","","","",null,null,null,"","","",{"$f":"IF(K93=\"\", \"\", VLOOKUP(K93,Projekte!C:D,2,FALSE))","v":""}]
[null,null,null,"","",null,"","","","",null,null,null,"","","",{"$f":"IF(K94=\"\", \"\", VLOOKUP(K94,Projekte!C:D,2,FALSE))","v":""}]
[null,null,null,"","",null,"","","","",null,null,null,"","","",{"$f":"IF(K95=\"\", \"\", VLOOKUP(K95,Projekte!C:D,2,FALSE))","v":""}]
[null,null,null,"","",null,"","","","",null,null,null,"","","",{"$f":"IF(K96=\"\", \"\", VLOOKUP(K96,Projekte!C:D,2,FALSE))","v":""}]
[null,null,null,"","",null,"","","","",null,null,null,"","","",{"$f":"IF(K97=\"\", \"\", VLOOKUP(K97,Projekte!C:D,2,FALSE))","v":""}]
[null,null,null,"","",null,"","","","",null,null,null,"","","",{"$f":"IF(K98=\"\", \"\", VLOOKUP(K98,Projekte!C:D,2,FALSE))","v":""}]
[null,null,null,"","",null,"","","","",null,null,null,"","","",{"$f":"IF(K99=\"\", \"\", VLOOKUP(K99,Projekte!C:D,2,FALSE))","v":""}]
[null,null,null,"","",null,{"$f":"IF(K100 = selectThisProjekt,E100, \"\")","v":""},"","","",null,null,null,"","","",{"$f":"IF(K100=\"\", \"\", VLOOKUP(K100,Projekte!C:D,2,FALSE))","v":""}]
[null,null,null,"","",null,"","","","",null,null,null,"","","",{"$f":"IF(K101=\"\", \"\", VLOOKUP(K101,Projekte!C:D,2,FALSE))","v":""}]
[null,null,null,"","",null,"","","","",null,null,null,"","","",{"$f":"IF(K102=\"\", \"\", VLOOKUP(K102,Projekte!C:D,2,FALSE))","v":""}]
[null,null,null,"","",null,"","","","",null,null,null,"","","",{"$f":"IF(K103=\"\", \"\", VLOOKUP(K103,Projekte!C:D,2,FALSE))","v":""}]
[null,null,null,"","",null,"","","","",null,null,null,"","","",{"$f":"IF(K104=\"\", \"\", VLOOKUP(K104,Projekte!C:D,2,FALSE))","v":""}]
[null,null,null,"","",null,"","","","",null,null,null,"","","",{"$f":"IF(K105=\"\", \"\", VLOOKUP(K105,Projekte!C:D,2,FALSE))","v":""}]
[null,null,null,"","",null,"","","","",null,null,null,"","","",{"$f":"IF(K106=\"\", \"\", VLOOKUP(K106,Projekte!C:D,2,FALSE))","v":""}]
[null,null,null,"","",null,"","","","",null,null,null,"","","",{"$f":"IF(K107=\"\", \"\", VLOOKUP(K107,Projekte!C:D,2,FALSE))","v":""}]
[null,null,null,"","",null,"","","","",null,null,null,"","","",{"$f":"IF(K108=\"\", \"\", VLOOKUP(K108,Projekte!C:D,2,FALSE))","v":""}]
[null,null,null,"","",null,"","","","",null,null,null,"","","",{"$f":"IF(K109=\"\", \"\", VLOOKUP(K109,Projekte!C:D,2,FALSE))","v":""}]
[null,null,null,"","",null,"","","","",null,null,null,"","","",{"$f":"IF(K110=\"\", \"\", VLOOKUP(K110,Projekte!C:D,2,FALSE))","v":""}]
[null,null,null,"","",null,"","","","",null,null,null,"","","",{"$f":"IF(K111=\"\", \"\", VLOOKUP(K111,Projekte!C:D,2,FALSE))","v":""}]
[null,null,null,"","",null,"","","","",null,null,null,"","","",{"$f":"IF(K112=\"\", \"\", VLOOKUP(K112,Projekte!C:D,2,FALSE))","v":""}]
[null,null,null,"","",null,"","","","",null,null,null,"","","",{"$f":"IF(K113=\"\", \"\", VLOOKUP(K113,Projekte!C:D,2,FALSE))","v":""}]
[null,null,null,"","",null,"","","","",null,null,null,"","","",{"$f":"IF(K114=\"\", \"\", VLOOKUP(K114,Projekte!C:D,2,FALSE))","v":""}]
[null,null,null,"","",null,"","","","",null,null,null,"","","",{"$f":"IF(K115=\"\", \"\", VLOOKUP(K115,Projekte!C:D,2,FALSE))","v":""}]
[null,null,null,"","",null,"","","","",null,null,null,"","","",{"$f":"IF(K116=\"\", \"\", VLOOKUP(K116,Projekte!C:D,2,FALSE))","v":""}]
[null,null,null,"","",null,"","","","",null,null,null,"","","",{"$f":"IF(K117=\"\", \"\", VLOOKUP(K117,Projekte!C:D,2,FALSE))","v":""}]
[null,null,null,"","",null,"","","","",null,null,null,"","","",{"$f":"IF(K118=\"\", \"\", VLOOKUP(K118,Projekte!C:D,2,FALSE))","v":""}]
[null,null,null,"","",null,"","","","",null,null,null,"","","",{"$f":"IF(K119=\"\", \"\", VLOOKUP(K119,Projekte!C:D,2,FALSE))","v":""}]
[null,null,null,"","",null,"","","","",null,null,null,"","","",{"$f":"IF(K120=\"\", \"\", VLOOKUP(K120,Projekte!C:D,2,FALSE))","v":""}]
[null,null,null,"","",null,"","","","",null,null,null,"","","",{"$f":"IF(K121=\"\", \"\", VLOOKUP(K121,Projekte!C:D,2,FALSE))","v":""}]
[null,null,null,"","",null,"","","","",null,null,null,"","","",{"$f":"IF(K122=\"\", \"\", VLOOKUP(K122,Projekte!C:D,2,FALSE))","v":""}]
[null,null,null,"","",null,{"$f":"IF(K123 = selectThisProjekt,E123, \"\")","v":""},"","","",null,null,null,"","","",{"$f":"IF(K123=\"\", \"\", VLOOKUP(K123,Projekte!C:D,2,FALSE))","v":""}]
[null,null,null,"","",null,"","","","",null,null,null,"","","",{"$f":"IF(K124=\"\", \"\", VLOOKUP(K124,Projekte!C:D,2,FALSE))","v":""}]
[null,null,null,"","",null,{"$f":"IF(K125 = selectThisProjekt,E125, \"\")","v":""},"","","",null,null,null,"","","",{"$f":"IF(K125=\"\", \"\", VLOOKUP(K125,Projekte!C:D,2,FALSE))","v":""}]
[null,null,null,"","",null,"","","","",null,null,null,"","","",{"$f":"IF(K126=\"\", \"\", VLOOKUP(K126,Projekte!C:D,2,FALSE))","v":""}]
[null,null,null,"","",null,"","","","",null,null,null,"","","",{"$f":"IF(K127=\"\", \"\", VLOOKUP(K127,Projekte!C:D,2,FALSE))","v":""}]
[null,null,null,"","",null,"","","","",null,null,null,"","","",{"$f":"IF(K128=\"\", \"\", VLOOKUP(K128,Projekte!C:D,2,FALSE))","v":""}]
[null,null,null,"","",null,"","","","",null,null,null,"","","",{"$f":"IF(K129=\"\", \"\", VLOOKUP(K129,Projekte!C:D,2,FALSE))","v":""}]
[null,null,null,"","",null,"","","","",null,null,null,"","","",{"$f":"IF(K130=\"\", \"\", VLOOKUP(K130,Projekte!C:D,2,FALSE))","v":""}]
[null,null,null,"","",null,"","","","",null,null,null,"","","",{"$f":"IF(K131=\"\", \"\", VLOOKUP(K131,Projekte!C:D,2,FALSE))","v":""}]
[null,null,null,{"$f":"IF(C132=\"\", \"\", C132-B132)","v":""},{"$f":"IF(D132=\"\", \"\", (C132-B132)*24)","v":""},null,{"$f":"IF(K132 = selectThisProjekt,E132, \"\")","v":""},"","","",null,null,null,"","","",{"$f":"IF(K132=\"\", \"\", VLOOKUP(K132,Projekte!C:D,2,FALSE))","v":""}]
[null,null,null,"","",null,"",{"$f":"IF(F133 = \"\", G133, \"\")","v":""},{"$f":"IF(LOWER(F133) = \"r\",G133,\"\")","v":""},{"$f":"IF(AND(F133<>\"\", LOWER(F133) <> \"r\"),G133,\"\")","v":""},null,null,null,"","","",{"$f":"IF(K133=\"\", \"\", VLOOKUP(K133,Projekte!C:D,2,FALSE))","v":""}]
[null,null,null,"","",null,"","","","",null,null,null,{"$f":"IF(M134<>\"\", \"\", IF(F134 = \"\", G134, \"\"))","v":""},{"$f":"IF(M134<>\"\", \"\", IF(LOWER(F134) = \"r\",G134,\"\"))","v":""},{"$f":"IF(M134<>\"\", \"\", IF(AND(F134<>\"\", LOWER(F134) <> \"r\"),G134,\"\"))","v":""},{"$f":"IF(K134=\"\", \"\", VLOOKUP(K134,Projekte!C:D,2,FALSE))","v":""}]
[null,null,null,"","",null,"","","","",null,null,null,"","","",{"$f":"IF(K135=\"\", \"\", VLOOKUP(K135,Projekte!C:D,2,FALSE))","v":""}]
[null,null,null,"","",null,"","","","",null,null,null,"","","",{"$f":"IF(K136=\"\", \"\", VLOOKUP(K136,Projekte!C:D,2,FALSE))","v":""}]
[null,null,null,"","",null,"","","","",null,null,null,"","","",{"$f":"IF(K137=\"\", \"\", VLOOKUP(K137,Projekte!C:D,2,FALSE))","v":""}]
[null,null,null,"","",null,"","","","",null,null,null,"","","",{"$f":"IF(K138=\"\", \"\", VLOOKUP(K138,Projekte!C:D,2,FALSE))","v":""}]
[null,null,null,"","",null,"","","","",null,null,null,"","","",{"$f":"IF(K139=\"\", \"\", VLOOKUP(K139,Projekte!C:D,2,FALSE))","v":""}]
[null,null,null,"","",null,"","","","",null,null,null,"","","",{"$f":"IF(K140=\"\", \"\", VLOOKUP(K140,Projekte!C:D,2,FALSE))","v":""}]
[null,null,null,"","",null,"","","","",null,null,null,"","","",{"$f":"IF(K141=\"\", \"\", VLOOKUP(K141,Projekte!C:D,2,FALSE))","v":""}]
[null,null,null,"","",null,"","","","",null,null,null,"","","",{"$f":"IF(K142=\"\", \"\", VLOOKUP(K142,Projekte!C:D,2,FALSE))","v":""}]
[null,null,null,"","",null,"","","","",null,null,null,"","","",{"$f":"IF(K143=\"\", \"\", VLOOKUP(K143,Projekte!C:D,2,FALSE))","v":""}]
[null,null,null,"","",null,"","","","",null,null,null,"","","",{"$f":"IF(K144=\"\", \"\", VLOOKUP(K144,Projekte!C:D,2,FALSE))","v":""}]
[null,null,null,"","",null,"","","","",null,null,null,"","","",{"$f":"IF(K145=\"\", \"\", VLOOKUP(K145,Projekte!C:D,2,FALSE))","v":""}]
[null,null,null,"","",null,"","","","",null,null,null,"","","",{"$f":"IF(K146=\"\", \"\", VLOOKUP(K146,Projekte!C:D,2,FALSE))","v":""}]
[null,null,null,"","",null,"","","","",null,null,null,"","","",{"$f":"IF(K147=\"\", \"\", VLOOKUP(K147,Projekte!C:D,2,FALSE))","v":""}]
[null,null,null,"","",null,"","","","",null,null,null,"","","",{"$f":"IF(K148=\"\", \"\", VLOOKUP(K148,Projekte!C:D,2,FALSE))","v":""}]
[null,null,null,"","",null,"","","","",null,null,null,"","","",{"$f":"IF(K149=\"\", \"\", VLOOKUP(K149,Projekte!C:D,2,FALSE))","v":""}]
[null,null,null,"","",null,"","","","",null,null,null,"","","",{"$f":"IF(K150=\"\", \"\", VLOOKUP(K150,Projekte!C:D,2,FALSE))","v":""}]
[null,null,null,"","",null,"","","","",null,null,null,"","","",{"$f":"IF(K151=\"\", \"\", VLOOKUP(K151,Projekte!C:D,2,FALSE))","v":""}]
[null,null,null,"","",null,"","","","",null,null,null,"","","",{"$f":"IF(K152=\"\", \"\", VLOOKUP(K152,Projekte!C:D,2,FALSE))","v":""}]
[null,null,null,"","",null,"","","","",null,null,null,"","","",{"$f":"IF(K153=\"\", \"\", VLOOKUP(K153,Projekte!C:D,2,FALSE))","v":""}]
[null,null,null,"","",null,"","","","",null,null,null,"","","",{"$f":"IF(K154=\"\", \"\", VLOOKUP(K154,Projekte!C:D,2,FALSE))","v":""}]
[null,null,null,"","",null,"","","","",null,null,null,"","","",{"$f":"IF(K155=\"\", \"\", VLOOKUP(K155,Projekte!C:D,2,FALSE))","v":""}]
[null,null,null,"","",null,"","","","",null,null,null,"","","",{"$f":"IF(K156=\"\", \"\", VLOOKUP(K156,Projekte!C:D,2,FALSE))","v":""}]
[null,null,null,"","",null,"","","","",null,null,null,"","","",{"$f":"IF(K157=\"\", \"\", VLOOKUP(K157,Projekte!C:D,2,FALSE))","v":""}]
[null,null,null,"","",null,"","","","",null,null,null,"","","",{"$f":"IF(K158=\"\", \"\", VLOOKUP(K158,Projekte!C:D,2,FALSE))","v":""}]
[null,null,null,"","",null,"","","","",null,null,null,"","","",{"$f":"IF(K159=\"\", \"\", VLOOKUP(K159,Projekte!C:D,2,FALSE))","v":""}]
[null,null,null,"","",null,"","","","",null,null,null,"","","",{"$f":"IF(K160=\"\", \"\", VLOOKUP(K160,Projekte!C:D,2,FALSE))","v":""}]
[null,null,null,"","",null,"","","","",null,null,null,"","","",{"$f":"IF(K161=\"\", \"\", VLOOKUP(K161,Projekte!C:D,2,FALSE))","v":""}]
[null,null,null,"","",null,"","","","",null,null,null,"","","",{"$f":"IF(K162=\"\", \"\", VLOOKUP(K162,Projekte!C:D,2,FALSE))","v":""}]
[null,null,null,"","",null,"","","","",null,null,null,"","","",{"$f":"IF(K163=\"\", \"\", VLOOKUP(K163,Projekte!C:D,2,FALSE))","v":""}]
[null,null,null,"","",null,{"$f":"IF(K164 = selectThisProjekt,E164, \"\")","v":""},"","","",null,null,null,"","","",{"$f":"IF(K164=\"\", \"\", VLOOKUP(K164,Projekte!C:D,2,FALSE))","v":""}]
[null,null,null,"","",null,"","","","",null,null,null,"","","",{"$f":"IF(K165=\"\", \"\", VLOOKUP(K165,Projekte!C:D,2,FALSE))","v":""}]
[null,null,null,"","",null,"","","","",null,null,null,"","","",{"$f":"IF(K166=\"\", \"\", VLOOKUP(K166,Projekte!C:D,2,FALSE))","v":""}]
[null,null,null,"","",null,"","","","",null,null,null,"","","",{"$f":"IF(K167=\"\", \"\", VLOOKUP(K167,Projekte!C:D,2,FALSE))","v":""}]
[null,null,null,"","",null,"","","","",null,null,null,"","","",{"$f":"IF(K168=\"\", \"\", VLOOKUP(K168,Projekte!C:D,2,FALSE))","v":""}]
[null,null,null,"","",null,"","","","",null,null,null,"","","",{"$f":"IF(K169=\"\", \"\", VLOOKUP(K169,Projekte!C:D,2,FALSE))","v":""}]
[null,null,null,"","",null,{"$f":"IF(K170 = selectThisProjekt,E170, \"\")","v":""},"","","",null,null,null,"","","",{"$f":"IF(K170=\"\", \"\", VLOOKUP(K170,Projekte!C:D,2,FALSE))","v":""}]
[null,null,null,"","",null,"","","","",null,null,null,"","","",{"$f":"IF(K171=\"\", \"\", VLOOKUP(K171,Projekte!C:D,2,FALSE))","v":""}]
[null,null,null,"","",null,"","","","",null,null,null,"","","",{"$f":"IF(K172=\"\", \"\", VLOOKUP(K172,Projekte!C:D,2,FALSE))","v":""}]
[null,null,null,"","",null,"","","","",null,null,null,"","","",{"$f":"IF(K173=\"\", \"\", VLOOKUP(K173,Projekte!C:D,2,FALSE))","v":""}]
[null,null,null,"","",null,"","","","",null,null,null,"","","",{"$f":"IF(K174=\"\", \"\", VLOOKUP(K174,Projekte!C:D,2,FALSE))","v":""}]
[null,null,null,"","",null,"","","","",null,null,null,"","","",{"$f":"IF(K175=\"\", \"\", VLOOKUP(K175,Projekte!C:D,2,FALSE))","v":""}]
[null,null,null,"","",null,"","","","",null,null,null,"","","",{"$f":"IF(K176=\"\", \"\", VLOOKUP(K176,Projekte!C:D,2,FALSE))","v":""}]
[null,null,null,"","",null,"","","","",null,null,null,"","","",{"$f":"IF(K177=\"\", \"\", VLOOKUP(K177,Projekte!C:D,2,FALSE))","v":""}]
[null,null,null,"","",null,"","","","",null,null,null,"","","",{"$f":"IF(K178=\"\", \"\", VLOOKUP(K178,Projekte!C:D,2,FALSE))","v":""}]
[null,null,null,"","",null,"","","","",null,null,null,"","","",{"$f":"IF(K179=\"\", \"\", VLOOKUP(K179,Projekte!C:D,2,FALSE))","v":""}]
[null,null,null,"","",null,"","","","",null,null,null,"","","",{"$f":"IF(K180=\"\", \"\", VLOOKUP(K180,Projekte!C:D,2,FALSE))","v":""}]
[null,null,null,"","",null,"","","","",null,null,null,"","","",{"$f":"IF(K181=\"\", \"\", VLOOKUP(K181,Projekte!C:D,2,FALSE))","v":""}]
[null,null,null,"","",null,"","","","",null,null,null,"","","",{"$f":"IF(K182=\"\", \"\", VLOOKUP(K182,Projekte!C:D,2,FALSE))","v":""}]
[null,null,null,"","",null,"","","","",null,null,null,"","","",{"$f":"IF(K183=\"\", \"\", VLOOKUP(K183,Projekte!C:D,2,FALSE))","v":""}]
[null,null,null,"","",null,"","","","",null,null,null,"","","",{"$f":"IF(K184=\"\", \"\", VLOOKUP(K184,Projekte!C:D,2,FALSE))","v":""}]
[null,null,null,"","",null,"","","","",null,null,null,"","","",{"$f":"IF(K185=\"\", \"\", VLOOKUP(K185,Projekte!C:D,2,FALSE))","v":""}]
[null,null,null,"","",null,"","","","",null,null,null,"","","",{"$f":"IF(K186=\"\", \"\", VLOOKUP(K186,Projekte!C:D,2,FALSE))","v":""}]
[null,null,null,"","",null,"","","","",null,null,null,"","","",{"$f":"IF(K187=\"\", \"\", VLOOKUP(K187,Projekte!C:D,2,FALSE))","v":""}]
[null,null,null,"","",null,"","","","",null,null,null,"","","",{"$f":"IF(K188=\"\", \"\", VLOOKUP(K188,Projekte!C:D,2,FALSE))","v":""}]
[null,null,null,"","",null,"","","","",null,null,null,"","","",{"$f":"IF(K189=\"\", \"\", VLOOKUP(K189,Projekte!C:D,2,FALSE))","v":""}]
[null,null,null,"","",null,"","","","",null,null,null,"","","",{"$f":"IF(K190=\"\", \"\", VLOOKUP(K190,Projekte!C:D,2,FALSE))","v":""}]
[null,null,null,"","",null,"","","","",null,null,null,"","","",{"$f":"IF(K191=\"\", \"\", VLOOKUP(K191,Projekte!C:D,2,FALSE))","v":""}]
[null,null,null,"","",null,"","","","",null,null,null,"","","",{"$f":"IF(K192=\"\", \"\", VLOOKUP(K192,Projekte!C:D,2,FALSE))","v":""}]
[null,null,null,"","",null,"","","","",null,null,null,"","","",{"$f":"IF(K193=\"\", \"\", VLOOKUP(K193,Projekte!C:D,2,FALSE))","v":""}]
[null,null,null,"","",null,"","","","",null,null,null,"","","",{"$f":"IF(K194=\"\", \"\", VLOOKUP(K194,Projekte!C:D,2,FALSE))","v":""}]
[null,null,null,"","",null,"","","","",null,null,null,"","","",{"$f":"IF(K195=\"\", \"\", VLOOKUP(K195,Projekte!C:D,2,FALSE))","v":""}]
[null,null,null,"","",null,"","","","",null,null,null,"","","",{"$f":"IF(K196=\"\", \"\", VLOOKUP(K196,Projekte!C:D,2,FALSE))","v":""}]
[null,null,null,"","",null,"","","","",null,null,null,"","","",{"$f":"IF(K197=\"\", \"\", VLOOKUP(K197,Projekte!C:D,2,FALSE))","v":""}]
[null,null,null,"","",null,"","","","",null,null,null,{"$f":"IF(M198<>\"\", \"\", IF(F198 = \"\", G198, \"\"))","v":""},{"$f":"IF(M198<>\"\", \"\", IF(LOWER(F198) = \"r\",G198,\"\"))","v":""},{"$f":"IF(M198<>\"\", \"\", IF(AND(F198<>\"\", LOWER(F198) <> \"r\"),G198,\"\"))","v":""},{"$f":"IF(K198=\"\", \"\", VLOOKUP(K198,Projekte!C:D,2,FALSE))","v":""}]
[null,null,null,"","",null,"","","","",null,null,null,"","","",{"$f":"IF(K199=\"\", \"\", VLOOKUP(K199,Projekte!C:D,2,FALSE))","v":""}]
[null,null,null,"","",null,"","","","",null,null,null,"","","",{"$f":"IF(K200=\"\", \"\", VLOOKUP(K200,Projekte!C:D,2,FALSE))","v":""}]
[null,null,null,"","",null,"","","","",null,null,null,"","","",{"$f":"IF(K201=\"\", \"\", VLOOKUP(K201,Projekte!C:D,2,FALSE))","v":""}]
[null,null,null,"","",null,"","","","",null,null,null,"","","",{"$f":"IF(K202=\"\", \"\", VLOOKUP(K202,Projekte!C:D,2,FALSE))","v":""}]
[null,null,null,"","",null,{"$f":"IF(K203 = selectThisProjekt,E203, \"\")","v":""},"","","",null,null,null,"","","",{"$f":"IF(K203=\"\", \"\", VLOOKUP(K203,Projekte!C:D,2,FALSE))","v":""}]
[null,null,null,"<Ende Formeln>"]

{"sheet":"Apr","index":4,"n_rows":204,"n_cols":17,"rows_kept":204,"cut":false,"hidden":false,"merged":[[0,13,0,15],[2,0,2,2]]}
[null,null,"DL-Zeiten von",{"$f":"AssignedToCfg","v":{"$error":"#REF!"}},null,null,null,null,null,null,null,null,null,"Faktura nicht erfasst"]
["Datum","Beginn","Ende","h","h,xx","r: Reise, \nx: nicht berechnen","Summe","Dienstleistung","Reise","nicht berechnen",null,"Tätigkeit","Faktura erfasst","Dienstleistung","Reise","nicht berechnen","Projektname"]
[null,null,null,null,null,"Summe",{"$f":"SUM(G4:G203)","v":0},{"$f":"SUM(H4:H203)","v":0},{"$f":"SUM(I4:I203)","v":0},{"$f":"SUM(J4:J203)","v":0},null,"<- für diesen ProjektBereich",null,{"$f":"SUM(N4:N203)","v":0},{"$f":"SUM(O4:O203)","v":0},{"$f":"SUM(P4:P203)","v":0}]
[null,null,null,{"$f":"IF(C4=\"\", \"\", C4-B4)","v":""},{"$f":"IF(D4=\"\", \"\", (C4-B4)*24)","v":""},null,{"$f":"IF(K4 = selectThisProjekt,E4, \"\")","v":""},{"$f":"IF(F4 = \"\", G4, \"\")","v":""},{"$f":"IF(LOWER(F4) = \"r\",G4,\"\")","v":""},{"$f":"IF(AND(F4<>\"\", LOWER(F4) <> \"r\"),G4,\"\")","v":""},null,null,null,{"$f":"IF(M4<>\"\", \"\", IF(F4 = \"\", G4, \"\"))","v":""},{"$f":"IF(M4<>\"\", \"\", IF(LOWER(F4) = \"r\",G4,\"\"))","v":""},{"$f":"IF(M4<>\"\", \"\", IF(AND(F4<>\"\", LOWER(F4) <> \"r\"),G4,\"\"))","v":""},{"$f":"IF(K4=\"\", \"\", VLOOKUP(K4,Projekte!C:D,2,FALSE))","v":""}]
[null,null,null,"","",null,"",{"$f":"IF(F5 = \"\", G5, \"\")","v":""},{"$f":"IF(LOWER(F5) = \"r\",G5,\"\")","v":""},{"$f":"IF(AND(F5<>\"\", LOWER(F5) <> \"r\"),G5,\"\")","v":""},null,null,null,{"$f":"IF(M5<>\"\", \"\", IF(F5 = \"\", G5, \"\"))","v":""},{"$f":"IF(M5<>\"\", \"\", IF(LOWER(F5) = \"r\",G5,\"\"))","v":""},{"$f":"IF(M5<>\"\", \"\", IF(AND(F5<>\"\", LOWER(F5) <> \"r\"),G5,\"\"))","v":""},{"$f":"IF(K5=\"\", \"\", VLOOKUP(K5,Projekte!C:D,2,FALSE))","v":""}]
[null,null,null,"","",null,"","","","",null,null,null,{"$f":"IF(M6<>\"\", \"\", IF(F6 = \"\", G6, \"\"))","v":""},{"$f":"IF(M6<>\"\", \"\", IF(LOWER(F6) = \"r\",G6,\"\"))","v":""},{"$f":"IF(M6<>\"\", \"\", IF(AND(F6<>\"\", LOWER(F6) <> \"r\"),G6,\"\"))","v":""},{"$f":"IF(K6=\"\", \"\", VLOOKUP(K6,Projekte!C:D,2,FALSE))","v":""}]
[null,null,null,"","",null,"","","","",null,null,null,"","","",{"$f":"IF(K7=\"\", \"\", VLOOKUP(K7,Projekte!C:D,2,FALSE))","v":""}]
[null,null,null,"","",null,"","","","",null,null,null,"","","",{"$f":"IF(K8=\"\", \"\", VLOOKUP(K8,Projekte!C:D,2,FALSE))","v":""}]
[null,null,null,"","",null,"","","","",null,null,null,"","","",{"$f":"IF(K9=\"\", \"\", VLOOKUP(K9,Projekte!C:D,2,FALSE))","v":""}]
[null,null,null,"","",null,"","","","",null,null,null,"","","",{"$f":"IF(K10=\"\", \"\", VLOOKUP(K10,Projekte!C:D,2,FALSE))","v":""}]
[null,null,null,"","",null,"","","","",null,null,null,"","","",{"$f":"IF(K11=\"\", \"\", VLOOKUP(K11,Projekte!C:D,2,FALSE))","v":""}]
[null,null,null,"","",null,"","","","",null,null,null,"","","",{"$f":"IF(K12=\"\", \"\", VLOOKUP(K12,Projekte!C:D,2,FALSE))","v":""}]
[null,null,null,"","",null,"","","","",null,null,null,"","","",{"$f":"IF(K13=\"\", \"\", VLOOKUP(K13,Projekte!C:D,2,FALSE))","v":""}]
[null,null,null,"","",null,"","","","",null,null,null,"","","",{"$f":"IF(K14=\"\", \"\", VLOOKUP(K14,Projekte!C:D,2,FALSE))","v":""}]
[null,null,null,"","",null,"","","","",null,null,null,"","","",{"$f":"IF(K15=\"\", \"\", VLOOKUP(K15,Projekte!C:D,2,FALSE))","v":""}]
[null,null,null,"","",null,"","","","",null,null,null,"","","",{"$f":"IF(K16=\"\", \"\", VLOOKUP(K16,Projekte!C:D,2,FALSE))","v":""}]
[null,null,null,"","",null,"","","","",null,null,null,"","","",{"$f":"IF(K17=\"\", \"\", VLOOKUP(K17,Projekte!C:D,2,FALSE))","v":""}]
[null,null,null,"","",null,"","","","",null,null,null,"","","",{"$f":"IF(K18=\"\", \"\", VLOOKUP(K18,Projekte!C:D,2,FALSE))","v":""}]
[null,null,null,"","",null,"","","","",null,null,null,"","","",{"$f":"IF(K19=\"\", \"\", VLOOKUP(K19,Projekte!C:D,2,FALSE))","v":""}]
[null,null,null,"","",null,"","","","",null,null,null,"","","",{"$f":"IF(K20=\"\", \"\", VLOOKUP(K20,Projekte!C:D,2,FALSE))","v":""}]
[null,null,null,"","",null,"","","","",null,null,null,"","","",{"$f":"IF(K21=\"\", \"\", VLOOKUP(K21,Projekte!C:D,2,FALSE))","v":""}]
[null,null,null,"","",null,"","","","",null,null,null,"","","",{"$f":"IF(K22=\"\", \"\", VLOOKUP(K22,Projekte!C:D,2,FALSE))","v":""}]
[null,null,null,"","",null,"","","","",null,null,null,"","","",{"$f":"IF(K23=\"\", \"\", VLOOKUP(K23,Projekte!C:D,2,FALSE))","v":""}]
[null,null,null,"","",null,"","","","",null,null,null,"","","",{"$f":"IF(K24=\"\", \"\", VLOOKUP(K24,Projekte!C:D,2,FALSE))","v":""}]
[null,null,null,"","",null,"",{"$f":"IF(F25 = \"\", G25, \"\")","v":""},{"$f":"IF(LOWER(F25) = \"r\",G25,\"\")","v":""},{"$f":"IF(AND(F25<>\"\", LOWER(F25) <> \"r\"),G25,\"\")","v":""},null,null,null,{"$f":"IF(M25<>\"\", \"\", IF(F25 = \"\", G25, \"\"))","v":""},{"$f":"IF(M25<>\"\", \"\", IF(LOWER(F25) = \"r\",G25,\"\"))","v":""},{"$f":"IF(M25<>\"\", \"\", IF(AND(F25<>\"\", LOWER(F25) <> \"r\"),G25,\"\"))","v":""},{"$f":"IF(K25=\"\", \"\", VLOOKUP(K25,Projekte!C:D,2,FALSE))","v":""}]
[null,null,null,"","",null,"","","","",null,null,null,"","","",{"$f":"IF(K26=\"\", \"\", VLOOKUP(K26,Projekte!C:D,2,FALSE))","v":""}]
[null,null,null,"","",null,"","","","",null,null,null,"","","",{"$f":"IF(K27=\"\", \"\", VLOOKUP(K27,Projekte!C:D,2,FALSE))","v":""}]
[null,null,null,"","",null,"","","","",null,null,null,"","","",{"$f":"IF(K28=\"\", \"\", VLOOKUP(K28,Projekte!C:D,2,FALSE))","v":""}]
[null,null,null,"","",null,"","","","",null,null,null,"","","",{"$f":"IF(K29=\"\", \"\", VLOOKUP(K29,Projekte!C:D,2,FALSE))","v":""}]
[null,null,null,"","",null,"","","","",null,null,null,"","","",{"$f":"IF(K30=\"\", \"\", VLOOKUP(K30,Projekte!C:D,2,FALSE))","v":""}]
[null,null,null,"","",null,"","","","",null,null,null,"","","",{"$f":"IF(K31=\"\", \"\", VLOOKUP(K31,Projekte!C:D,2,FALSE))","v":""}]
[null,null,null,"","",null,"","","","",null,null,null,"","","",{"$f":"IF(K32=\"\", \"\", VLOOKUP(K32,Projekte!C:D,2,FALSE))","v":""}]
[null,null,null,"","",null,"","","","",null,null,null,"","","",{"$f":"IF(K33=\"\", \"\", VLOOKUP(K33,Projekte!C:D,2,FALSE))","v":""}]
[null,null,null,"","",null,"","","","",null,null,null,"","","",{"$f":"IF(K34=\"\", \"\", VLOOKUP(K34,Projekte!C:D,2,FALSE))","v":""}]
[null,null,null,"","",null,"","","","",null,null,null,"","","",{"$f":"IF(K35=\"\", \"\", VLOOKUP(K35,Projekte!C:D,2,FALSE))","v":""}]
[null,null,null,"","",null,{"$f":"IF(K36 = selectThisProjekt,E36, \"\")","v":""},"","","",null,null,null,"","","",{"$f":"IF(K36=\"\", \"\", VLOOKUP(K36,Projekte!C:D,2,FALSE))","v":""}]
[null,null,null,"","",null,"","","","",null,null,null,"","","",{"$f":"IF(K37=\"\", \"\", VLOOKUP(K37,Projekte!C:D,2,FALSE))","v":""}]
[null,null,null,"","",null,"","","","",null,null,null,"","","",{"$f":"IF(K38=\"\", \"\", VLOOKUP(K38,Projekte!C:D,2,FALSE))","v":""}]
[null,null,null,"","",null,"","","","",null,null,null,"","","",{"$f":"IF(K39=\"\", \"\", VLOOKUP(K39,Projekte!C:D,2,FALSE))","v":""}]
[null,null,null,"","",null,"","","","",null,null,null,"","","",{"$f":"IF(K40=\"\", \"\", VLOOKUP(K40,Projekte!C:D,2,FALSE))","v":""}]
[null,null,null,"","",null,"","","","",null,null,null,"","","",{"$f":"IF(K41=\"\", \"\", VLOOKUP(K41,Projekte!C:D,2,FALSE))","v":""}]
[null,null,null,"","",null,"","","","",null,null,null,"","","",{"$f":"IF(K42=\"\", \"\", VLOOKUP(K42,Projekte!C:D,2,FALSE))","v":""}]
[null,null,null,"","",null,"","","","",null,null,null,"","","",{"$f":"IF(K43=\"\", \"\", VLOOKUP(K43,Projekte!C:D,2,FALSE))","v":""}]
[null,null,null,"","",null,"","","","",null,null,null,"","","",{"$f":"IF(K44=\"\", \"\", VLOOKUP(K44,Projekte!C:D,2,FALSE))","v":""}]
[null,null,null,"","",null,"","","","",null,null,null,"","","",{"$f":"IF(K45=\"\", \"\", VLOOKUP(K45,Projekte!C:D,2,FALSE))","v":""}]
[null,null,null,"","",null,"","","","",null,null,null,"","","",{"$f":"IF(K46=\"\", \"\", VLOOKUP(K46,Projekte!C:D,2,FALSE))","v":""}]
[null,null,null,"","",null,"","","","",null,null,null,"","","",{"$f":"IF(K47=\"\", \"\", VLOOKUP(K47,Projekte!C:D,2,FALSE))","v":""}]
[null,null,null,"","",null,"","","","",null,null,null,"","","",{"$f":"IF(K48=\"\", \"\", VLOOKUP(K48,Projekte!C:D,2,FALSE))","v":""}]
[null,null,null,"","",null,"","","","",null,null,null,"","","",{"$f":"IF(K49=\"\", \"\", VLOOKUP(K49,Projekte!C:D,2,FALSE))","v":""}]
[null,null,null,"","",null,"","","","",null,null,null,"","","",{"$f":"IF(K50=\"\", \"\", VLOOKUP(K50,Projekte!C:D,2,FALSE))","v":""}]
[null,null,null,"","",null,"","","","",null,null,null,"","","",{"$f":"IF(K51=\"\", \"\", VLOOKUP(K51,Projekte!C:D,2,FALSE))","v":""}]
[null,null,null,"","",null,"","","","",null,null,null,"","","",{"$f":"IF(K52=\"\", \"\", VLOOKUP(K52,Projekte!C:D,2,FALSE))","v":""}]
[null,null,null,"","",null,"","","","",null,null,null,"","","",{"$f":"IF(K53=\"\", \"\", VLOOKUP(K53,Projekte!C:D,2,FALSE))","v":""}]
[null,null,null,"","",null,"","","","",null,null,null,"","","",{"$f":"IF(K54=\"\", \"\", VLOOKUP(K54,Projekte!C:D,2,FALSE))","v":""}]
[null,null,null,"","",null,"","","","",null,null,null,"","","",{"$f":"IF(K55=\"\", \"\", VLOOKUP(K55,Projekte!C:D,2,FALSE))","v":""}]
[null,null,null,"","",null,"","","","",null,null,null,"","","",{"$f":"IF(K56=\"\", \"\", VLOOKUP(K56,Projekte!C:D,2,FALSE))","v":""}]
[null,null,null,"","",null,"","","","",null,null,null,"","","",{"$f":"IF(K57=\"\", \"\", VLOOKUP(K57,Projekte!C:D,2,FALSE))","v":""}]
[null,null,null,"","",null,"","","","",null,null,null,"","","",{"$f":"IF(K58=\"\", \"\", VLOOKUP(K58,Projekte!C:D,2,FALSE))","v":""}]
[null,null,null,"","",null,"","","","",null,null,null,"","","",{"$f":"IF(K59=\"\", \"\", VLOOKUP(K59,Projekte!C:D,2,FALSE))","v":""}]
[null,null,null,"","",null,"","","","",null,null,null,"","","",{"$f":"IF(K60=\"\", \"\", VLOOKUP(K60,Projekte!C:D,2,FALSE))","v":""}]
[null,null,null,"","",null,"","","","",null,null,null,"","","",{"$f":"IF(K61=\"\", \"\", VLOOKUP(K61,Projekte!C:D,2,FALSE))","v":""}]
[null,null,null,"","",null,"","","","",null,null,null,"","","",{"$f":"IF(K62=\"\", \"\", VLOOKUP(K62,Projekte!C:D,2,FALSE))","v":""}]
[null,null,null,"","",null,"","","","",null,null,null,"","","",{"$f":"IF(K63=\"\", \"\", VLOOKUP(K63,Projekte!C:D,2,FALSE))","v":""}]
[null,null,null,"","",null,"","","","",null,null,null,"","","",{"$f":"IF(K64=\"\", \"\", VLOOKUP(K64,Projekte!C:D,2,FALSE))","v":""}]
[null,null,null,"","",null,"","","","",null,null,null,"","","",{"$f":"IF(K65=\"\", \"\", VLOOKUP(K65,Projekte!C:D,2,FALSE))","v":""}]
[null,null,null,"","",null,"","","","",null,null,null,"","","",{"$f":"IF(K66=\"\", \"\", VLOOKUP(K66,Projekte!C:D,2,FALSE))","v":""}]
[null,null,null,"","",null,"","","","",null,null,null,"","","",{"$f":"IF(K67=\"\", \"\", VLOOKUP(K67,Projekte!C:D,2,FALSE))","v":""}]
[null,null,null,{"$f":"IF(C68=\"\", \"\", C68-B68)","v":""},{"$f":"IF(D68=\"\", \"\", (C68-B68)*24)","v":""},null,{"$f":"IF(K68 = selectThisProjekt,E68, \"\")","v":""},"","","",null,null,null,"","","",{"$f":"IF(K68=\"\", \"\", VLOOKUP(K68,Projekte!C:D,2,FALSE))","v":""}]
[null,null,null,"","",null,"",{"$f":"IF(F69 = \"\", G69, \"\")","v":""},{"$f":"IF(LOWER(F69) = \"r\",G69,\"\")","v":""},{"$f":"IF(AND(F69<>\"\", LOWER(F69) <> \"r\"),G69,\"\")","v":""},null,null,null,"","","",{"$f":"IF(K69=\"\", \"\", VLOOKUP(K69,Projekte!C:D,2,FALSE))","v":""}]
[null,null,null,"","",null,"","","","",null,null,null,{"$f":"IF(M70<>\"\", \"\", IF(F70 = \"\", G70, \"\"))","v":""},{"$f":"IF(M70<>\"\", \"\", IF(LOWER(F70) = \"r\",G70,\"\"))","v":""},{"$f":"IF(M70<>\"\", \"\", IF(AND(F70<>\"\", LOWER(F70) <> \"r\"),G70,\"\"))","v":""},{"$f":"IF(K70=\"\", \"\", VLOOKUP(K70,Projekte!C:D,2,FALSE))","v":""}]
[null,null,null,"","",null,"","","","",null,null,null,"","","",{"$f":"IF(K71=\"\", \"\", VLOOKUP(K71,Projekte!C:D,2,FALSE))","v":""}]
[null,null,null,"","",null,"","","","",null,null,null,"","","",{"$f":"IF(K72=\"\", \"\", VLOOKUP(K72,Projekte!C:D,2,FALSE))","v":""}]
[null,null,null,"","",null,"","","","",null,null,null,"","","",{"$f":"IF(K73=\"\", \"\", VLOOKUP(K73,Projekte!C:D,2,FALSE))","v":""}]
[null,null,null,"","",null,"","","","",null,null,null,"","","",{"$f":"IF(K74=\"\", \"\", VLOOKUP(K74,Projekte!C:D,2,FALSE))","v":""}]
[null,null,null,"","",null,"","","","",null,null,null,"","","",{"$f":"IF(K75=\"\", \"\", VLOOKUP(K75,Projekte!C:D,2,FALSE))","v":""}]
[null,null,null,"","",null,"","","","",null,null,null,"","","",{"$f":"IF(K76=\"\", \"\", VLOOKUP(K76,Projekte!C:D,2,FALSE))","v":""}]
[null,null,null,"","",null,"","","","",null,null,null,"","","",{"$f":"IF(K77=\"\", \"\", VLOOKUP(K77,Projekte!C:D,2,FALSE))","v":""}]
[null,null,null,"","",null,"","","","",null,null,null,"","","",{"$f":"IF(K78=\"\", \"\", VLOOKUP(K78,Projekte!C:D,2,FALSE))","v":""}]
[null,null,null,"","",null,"","","","",null,null,null,"","","",{"$f":"IF(K79=\"\", \"\", VLOOKUP(K79,Projekte!C:D,2,FALSE))","v":""}]
[null,null,null,"","",null,"","","","",null,null,null,"","","",{"$f":"IF(K80=\"\", \"\", VLOOKUP(K80,Projekte!C:D,2,FALSE))","v":""}]
[null,null,null,"","",null,"","","","",null,null,null,"","","",{"$f":"IF(K81=\"\", \"\", VLOOKUP(K81,Projekte!C:D,2,FALSE))","v":""}]
[null,null,null,"","",null,"","","","",null,null,null,"","","",{"$f":"IF(K82=\"\", \"\", VLOOKUP(K82,Projekte!C:D,2,FALSE))","v":""}]
[null,null,null,"","",null,"","","","",null,null,null,"","","",{"$f":"IF(K83=\"\", \"\", VLOOKUP(K83,Projekte!C:D,2,FALSE))","v":""}]
[null,null,null,"","",null,"","","","",null,null,null,"","","",{"$f":"IF(K84=\"\", \"\", VLOOKUP(K84,Projekte!C:D,2,FALSE))","v":""}]
[null,null,null,"","",null,"","","","",null,null,null,"","","",{"$f":"IF(K85=\"\", \"\", VLOOKUP(K85,Projekte!C:D,2,FALSE))","v":""}]
[null,null,null,"","",null,"","","","",null,null,null,"","","",{"$f":"IF(K86=\"\", \"\", VLOOKUP(K86,Projekte!C:D,2,FALSE))","v":""}]
[null,null,null,"","",null,"","","","",null,null,null,"","","",{"$f":"IF(K87=\"\", \"\", VLOOKUP(K87,Projekte!C:D,2,FALSE))","v":""}]
[null,null,null,"","",null,"","","","",null,null,null,"","","",{"$f":"IF(K88=\"\", \"\", VLOOKUP(K88,Projekte!C:D,2,FALSE))","v":""}]
[null,null,null,"","",null,"","","","",null,null,null,"","","",{"$f":"IF(K89=\"\", \"\", VLOOKUP(K89,Projekte!C:D,2,FALSE))","v":""}]
[null,null,null,"","",null,"","","","",null,null,null,"","","",{"$f":"IF(K90=\"\", \"\", VLOOKUP(K90,Projekte!C:D,2,FALSE))","v":""}]
[null,null,null,"","",null,"","","","",null,null,null,"","","",{"$f":"IF(K91=\"\", \"\", VLOOKUP(K91,Projekte!C:D,2,FALSE))","v":""}]
[null,null,null,"","",null,"","","","",null,null,null,"","","",{"$f":"IF(K92=\"\", \"\", VLOOKUP(K92,Projekte!C:D,2,FALSE))","v":""}]
[null,null,null,"","",null,"","","","",null,null,null,"","","",{"$f":"IF(K93=\"\", \"\", VLOOKUP(K93,Projekte!C:D,2,FALSE))","v":""}]
[null,null,null,"","",null,"","","","",null,null,null,"","","",{"$f":"IF(K94=\"\", \"\", VLOOKUP(K94,Projekte!C:D,2,FALSE))","v":""}]
[null,null,null,"","",null,"","","","",null,null,null,"","","",{"$f":"IF(K95=\"\", \"\", VLOOKUP(K95,Projekte!C:D,2,FALSE))","v":""}]
[null,null,null,"","",null,"","","","",null,null,null,"","","",{"$f":"IF(K96=\"\", \"\", VLOOKUP(K96,Projekte!C:D,2,FALSE))","v":""}]
[null,null,null,"","",null,"","","","",null,null,null,"","","",{"$f":"IF(K97=\"\", \"\", VLOOKUP(K97,Projekte!C:D,2,FALSE))","v":""}]
[null,null,null,"","",null,"","","","",null,null,null,"","","",{"$f":"IF(K98=\"\", \"\", VLOOKUP(K98,Projekte!C:D,2,FALSE))","v":""}]
[null,null,null,"","",null,"","","","",null,null,null,"","","",{"$f":"IF(K99=\"\", \"\", VLOOKUP(K99,Projekte!C:D,2,FALSE))","v":""}]
[null,null,null,"","",null,{"$f":"IF(K100 = selectThisProjekt,E100, \"\")","v":""},"","","",null,null,null,"","","",{"$f":"IF(K100=\"\", \"\", VLOOKUP(K100,Projekte!C:D,2,FALSE))","v":""}]
[null,null,null,"","",null,"","","","",null,null,null,"","","",{"$f":"IF(K101=\"\", \"\", VLOOKUP(K101,Projekte!C:D,2,FALSE))","v":""}]
[null,null,null,"","",null,"","","","",null,null,null,"","","",{"$f":"IF(K102=\"\", \"\", VLOOKUP(K102,Projekte!C:D,2,FALSE))","v":""}]
[null,null,null,"","",null,"","","","",null,null,null,"","","",{"$f":"IF(K103=\"\", \"\", VLOOKUP(K103,Projekte!C:D,2,FALSE))","v":""}]
[null,null,null,"","",null,"","","","",null,null,null,"","","",{"$f":"IF(K104=\"\", \"\", VLOOKUP(K104,Projekte!C:D,2,FALSE))","v":""}]
[null,null,null,"","",null,"","","","",null,null,null,"","","",{"$f":"IF(K105=\"\", \"\", VLOOKUP(K105,Projekte!C:D,2,FALSE))","v":""}]
[null,null,null,"","",null,"","","","",null,null,null,"","","",{"$f":"IF(K106=\"\", \"\", VLOOKUP(K106,Projekte!C:D,2,FALSE))","v":""}]
[null,null,null,"","",null,"","","","",null,null,null,"","","",{"$f":"IF(K107=\"\", \"\", VLOOKUP(K107,Projekte!C:D,2,FALSE))","v":""}]
[null,null,null,"","",null,"","","","",null,null,null,"","","",{"$f":"IF(K108=\"\", \"\", VLOOKUP(K108,Projekte!C:D,2,FALSE))","v":""}]
[null,null,null,"","",null,"","","","",null,null,null,"","","",{"$f":"IF(K109=\"\", \"\", VLOOKUP(K109,Projekte!C:D,2,FALSE))","v":""}]
[null,null,null,"","",null,"","","","",null,null,null,"","","",{"$f":"IF(K110=\"\", \"\", VLOOKUP(K110,Projekte!C:D,2,FALSE))","v":""}]
[null,null,null,"","",null,"","","","",null,null,null,"","","",{"$f":"IF(K111=\"\", \"\", VLOOKUP(K111,Projekte!C:D,2,FALSE))","v":""}]
[null,null,null,"","",null,"","","","",null,null,null,"","","",{"$f":"IF(K112=\"\", \"\", VLOOKUP(K112,Projekte!C:D,2,FALSE))","v":""}]
[null,null,null,"","",null,"","","","",null,null,null,"","","",{"$f":"IF(K113=\"\", \"\", VLOOKUP(K113,Projekte!C:D,2,FALSE))","v":""}]
[null,null,null,"","",null,"","","","",null,null,null,"","","",{"$f":"IF(K114=\"\", \"\", VLOOKUP(K114,Projekte!C:D,2,FALSE))","v":""}]
[null,null,null,"","",null,"","","","",null,null,null,"","","",{"$f":"IF(K115=\"\", \"\", VLOOKUP(K115,Projekte!C:D,2,FALSE))","v":""}]
[null,null,null,"","",null,"","","","",null,null,null,"","","",{"$f":"IF(K116=\"\", \"\", VLOOKUP(K116,Projekte!C:D,2,FALSE))","v":""}]
[null,null,null,"","",null,"","","","",null,null,null,"","","",{"$f":"IF(K117=\"\", \"\", VLOOKUP(K117,Projekte!C:D,2,FALSE))","v":""}]
[null,null,null,"","",null,"","","","",null,null,null,"","","",{"$f":"IF(K118=\"\", \"\", VLOOKUP(K118,Projekte!C:D,2,FALSE))","v":""}]
[null,null,null,"","",null,"","","","",null,null,null,"","","",{"$f":"IF(K119=\"\", \"\", VLOOKUP(K119,Projekte!C:D,2,FALSE))","v":""}]
[null,null,null,"","",null,"","","","",null,null,null,"","","",{"$f":"IF(K120=\"\", \"\", VLOOKUP(K120,Projekte!C:D,2,FALSE))","v":""}]
[null,null,null,"","",null,"","","","",null,null,null,"","","",{"$f":"IF(K121=\"\", \"\", VLOOKUP(K121,Projekte!C:D,2,FALSE))","v":""}]
[null,null,null,"","",null,"","","","",null,null,null,"","","",{"$f":"IF(K122=\"\", \"\", VLOOKUP(K122,Projekte!C:D,2,FALSE))","v":""}]
[null,null,null,"","",null,{"$f":"IF(K123 = selectThisProjekt,E123, \"\")","v":""},"","","",null,null,null,"","","",{"$f":"IF(K123=\"\", \"\", VLOOKUP(K123,Projekte!C:D,2,FALSE))","v":""}]
[null,null,null,"","",null,"","","","",null,null,null,"","","",{"$f":"IF(K124=\"\", \"\", VLOOKUP(K124,Projekte!C:D,2,FALSE))","v":""}]
[null,null,null,"","",null,{"$f":"IF(K125 = selectThisProjekt,E125, \"\")","v":""},"","","",null,null,null,"","","",{"$f":"IF(K125=\"\", \"\", VLOOKUP(K125,Projekte!C:D,2,FALSE))","v":""}]
[null,null,null,"","",null,"","","","",null,null,null,"","","",{"$f":"IF(K126=\"\", \"\", VLOOKUP(K126,Projekte!C:D,2,FALSE))","v":""}]
[null,null,null,"","",null,"","","","",null,null,null,"","","",{"$f":"IF(K127=\"\", \"\", VLOOKUP(K127,Projekte!C:D,2,FALSE))","v":""}]
[null,null,null,"","",null,"","","","",null,null,null,"","","",{"$f":"IF(K128=\"\", \"\", VLOOKUP(K128,Projekte!C:D,2,FALSE))","v":""}]
[null,null,null,"","",null,"","","","",null,null,null,"","","",{"$f":"IF(K129=\"\", \"\", VLOOKUP(K129,Projekte!C:D,2,FALSE))","v":""}]
[null,null,null,"","",null,"","","","",null,null,null,"","","",{"$f":"IF(K130=\"\", \"\", VLOOKUP(K130,Projekte!C:D,2,FALSE))","v":""}]
[null,null,null,"","",null,"","","","",null,null,null,"","","",{"$f":"IF(K131=\"\", \"\", VLOOKUP(K131,Projekte!C:D,2,FALSE))","v":""}]
[null,null,null,{"$f":"IF(C132=\"\", \"\", C132-B132)","v":""},{"$f":"IF(D132=\"\", \"\", (C132-B132)*24)","v":""},null,{"$f":"IF(K132 = selectThisProjekt,E132, \"\")","v":""},"","","",null,null,null,"","","",{"$f":"IF(K132=\"\", \"\", VLOOKUP(K132,Projekte!C:D,2,FALSE))","v":""}]
[null,null,null,"","",null,"",{"$f":"IF(F133 = \"\", G133, \"\")","v":""},{"$f":"IF(LOWER(F133) = \"r\",G133,\"\")","v":""},{"$f":"IF(AND(F133<>\"\", LOWER(F133) <> \"r\"),G133,\"\")","v":""},null,null,null,"","","",{"$f":"IF(K133=\"\", \"\", VLOOKUP(K133,Projekte!C:D,2,FALSE))","v":""}]
[null,null,null,"","",null,"","","","",null,null,null,{"$f":"IF(M134<>\"\", \"\", IF(F134 = \"\", G134, \"\"))","v":""},{"$f":"IF(M134<>\"\", \"\", IF(LOWER(F134) = \"r\",G134,\"\"))","v":""},{"$f":"IF(M134<>\"\", \"\", IF(AND(F134<>\"\", LOWER(F134) <> \"r\"),G134,\"\"))","v":""},{"$f":"IF(K134=\"\", \"\", VLOOKUP(K134,Projekte!C:D,2,FALSE))","v":""}]
[null,null,null,"","",null,"","","","",null,null,null,"","","",{"$f":"IF(K135=\"\", \"\", VLOOKUP(K135,Projekte!C:D,2,FALSE))","v":""}]
[null,null,null,"","",null,"","","","",null,null,null,"","","",{"$f":"IF(K136=\"\", \"\", VLOOKUP(K136,Projekte!C:D,2,FALSE))","v":""}]
[null,null,null,"","",null,"","","","",null,null,null,"","","",{"$f":"IF(K137=\"\", \"\", VLOOKUP(K137,Projekte!C:D,2,FALSE))","v":""}]
[null,null,null,"","",null,"","","","",null,null,null,"","","",{"$f":"IF(K138=\"\", \"\", VLOOKUP(K138,Projekte!C:D,2,FALSE))","v":""}]
[null,null,null,"","",null,"","","","",null,null,null,"","","",{"$f":"IF(K139=\"\", \"\", VLOOKUP(K139,Projekte!C:D,2,FALSE))","v":""}]
[null,null,null,"","",null,"","","","",null,null,null,"","","",{"$f":"IF(K140=\"\", \"\", VLOOKUP(K140,Projekte!C:D,2,FALSE))","v":""}]
[null,null,null,"","",null,"","","","",null,null,null,"","","",{"$f":"IF(K141=\"\", \"\", VLOOKUP(K141,Projekte!C:D,2,FALSE))","v":""}]
[null,null,null,"","",null,"","","","",null,null,null,"","","",{"$f":"IF(K142=\"\", \"\", VLOOKUP(K142,Projekte!C:D,2,FALSE))","v":""}]
[null,null,null,"","",null,"","","","",null,null,null,"","","",{"$f":"IF(K143=\"\", \"\", VLOOKUP(K143,Projekte!C:D,2,FALSE))","v":""}]
[null,null,null,"","",null,"","","","",null,null,null,"","","",{"$f":"IF(K144=\"\", \"\", VLOOKUP(K144,Projekte!C:D,2,FALSE))","v":""}]
[null,null,null,"","",null,"","","","",null,null,null,"","","",{"$f":"IF(K145=\"\", \"\", VLOOKUP(K145,Projekte!C:D,2,FALSE))","v":""}]
[null,null,null,"","",null,"","","","",null,null,null,"","","",{"$f":"IF(K146=\"\", \"\", VLOOKUP(K146,Projekte!C:D,2,FALSE))","v":""}]
[null,null,null,"","",null,"","","","",null,null,null,"","","",{"$f":"IF(K147=\"\", \"\", VLOOKUP(K147,Projekte!C:D,2,FALSE))","v":""}]
[null,null,null,"","",null,"","","","",null,null,null,"","","",{"$f":"IF(K148=\"\", \"\", VLOOKUP(K148,Projekte!C:D,2,FALSE))","v":""}]
[null,null,null,"","",null,"","","","",null,null,null,"","","",{"$f":"IF(K149=\"\", \"\", VLOOKUP(K149,Projekte!C:D,2,FALSE))","v":""}]
[null,null,null,"","",null,"","","","",null,null,null,"","","",{"$f":"IF(K150=\"\", \"\", VLOOKUP(K150,Projekte!C:D,2,FALSE))","v":""}]
[null,null,null,"","",null,"","","","",null,null,null,"","","",{"$f":"IF(K151=\"\", \"\", VLOOKUP(K151,Projekte!C:D,2,FALSE))","v":""}]
[null,null,null,"","",null,"","","","",null,null,null,"","","",{"$f":"IF(K152=\"\", \"\", VLOOKUP(K152,Projekte!C:D,2,FALSE))","v":""}]
[null,null,null,"","",null,"","","","",null,null,null,"","","",{"$f":"IF(K153=\"\", \"\", VLOOKUP(K153,Projekte!C:D,2,FALSE))","v":""}]
[null,null,null,"","",null,"","","","",null,null,null,"","","",{"$f":"IF(K154=\"\", \"\", VLOOKUP(K154,Projekte!C:D,2,FALSE))","v":""}]
[null,null,null,"","",null,"","","","",null,null,null,"","","",{"$f":"IF(K155=\"\", \"\", VLOOKUP(K155,Projekte!C:D,2,FALSE))","v":""}]
[null,null,null,"","",null,"","","","",null,null,null,"","","",{"$f":"IF(K156=\"\", \"\", VLOOKUP(K156,Projekte!C:D,2,FALSE))","v":""}]
[null,null,null,"","",null,"","","","",null,null,null,"","","",{"$f":"IF(K157=\"\", \"\", VLOOKUP(K157,Projekte!C:D,2,FALSE))","v":""}]
[null,null,null,"","",null,"","","","",null,null,null,"","","",{"$f":"IF(K158=\"\", \"\", VLOOKUP(K158,Projekte!C:D,2,FALSE))","v":""}]
[null,null,null,"","",null,"","","","",null,null,null,"","","",{"$f":"IF(K159=\"\", \"\", VLOOKUP(K159,Projekte!C:D,2,FALSE))","v":""}]
[null,null,null,"","",null,"","","","",null,null,null,"","","",{"$f":"IF(K160=\"\", \"\", VLOOKUP(K160,Projekte!C:D,2,FALSE))","v":""}]
[null,null,null,"","",null,"","","","",null,null,null,"","","",{"$f":"IF(K161=\"\", \"\", VLOOKUP(K161,Projekte!C:D,2,FALSE))","v":""}]
[null,null,null,"","",null,"","","","",null,null,null,"","","",{"$f":"IF(K162=\"\", \"\", VLOOKUP(K162,Projekte!C:D,2,FALSE))","v":""}]
[null,null,null,"","",null,"","","","",null,null,null,"","","",{"$f":"IF(K163=\"\", \"\", VLOOKUP(K163,Projekte!C:D,2,FALSE))","v":""}]
[null,null,null,"","",null,{"$f":"IF(K164 = selectThisProjekt,E164, \"\")","v":""},"","","",null,null,null,"","","",{"$f":"IF(K164=\"\", \"\", VLOOKUP(K164,Projekte!C:D,2,FALSE))","v":""}]
[null,null,null,"","",null,"","","","",null,null,null,"","","",{"$f":"IF(K165=\"\", \"\", VLOOKUP(K165,Projekte!C:D,2,FALSE))","v":""}]
[null,null,null,"","",null,"","","","",null,null,null,"","","",{"$f":"IF(K166=\"\", \"\", VLOOKUP(K166,Projekte!C:D,2,FALSE))","v":""}]
[null,null,null,"","",null,"","","","",null,null,null,"","","",{"$f":"IF(K167=\"\", \"\", VLOOKUP(K167,Projekte!C:D,2,FALSE))","v":""}]
[null,null,null,"","",null,"","","","",null,null,null,"","","",{"$f":"IF(K168=\"\", \"\", VLOOKUP(K168,Projekte!C:D,2,FALSE))","v":""}]
[null,null,null,"","",null,"","","","",null,null,null,"","","",{"$f":"IF(K169=\"\", \"\", VLOOKUP(K169,Projekte!C:D,2,FALSE))","v":""}]
[null,null,null,"","",null,{"$f":"IF(K170 = selectThisProjekt,E170, \"\")","v":""},"","","",null,null,null,"","","",{"$f":"IF(K170=\"\", \"\", VLOOKUP(K170,Projekte!C:D,2,FALSE))","v":""}]
[null,null,null,"","",null,"","","","",null,null,null,"","","",{"$f":"IF(K171=\"\", \"\", VLOOKUP(K171,Projekte!C:D,2,FALSE))","v":""}]
[null,null,null,"","",null,"","","","",null,null,null,"","","",{"$f":"IF(K172=\"\", \"\", VLOOKUP(K172,Projekte!C:D,2,FALSE))","v":""}]
[null,null,null,"","",null,"","","","",null,null,null,"","","",{"$f":"IF(K173=\"\", \"\", VLOOKUP(K173,Projekte!C:D,2,FALSE))","v":""}]
[null,null,null,"","",null,"","","","",null,null,null,"","","",{"$f":"IF(K174=\"\", \"\", VLOOKUP(K174,Projekte!C:D,2,FALSE))","v":""}]
[null,null,null,"","",null,"","","","",null,null,null,"","","",{"$f":"IF(K175=\"\", \"\", VLOOKUP(K175,Projekte!C:D,2,FALSE))","v":""}]
[null,null,null,"","",null,"","","","",null,null,null,"","","",{"$f":"IF(K176=\"\", \"\", VLOOKUP(K176,Projekte!C:D,2,FALSE))","v":""}]
[null,null,null,"","",null,"","","","",null,null,null,"","","",{"$f":"IF(K177=\"\", \"\", VLOOKUP(K177,Projekte!C:D,2,FALSE))","v":""}]
[null,null,null,"","",null,"","","","",null,null,null,"","","",{"$f":"IF(K178=\"\", \"\", VLOOKUP(K178,Projekte!C:D,2,FALSE))","v":""}]
[null,null,null,"","",null,"","","","",null,null,null,"","","",{"$f":"IF(K179=\"\", \"\", VLOOKUP(K179,Projekte!C:D,2,FALSE))","v":""}]
[null,null,null,"","",null,"","","","",null,null,null,"","","",{"$f":"IF(K180=\"\", \"\", VLOOKUP(K180,Projekte!C:D,2,FALSE))","v":""}]
[null,null,null,"","",null,"","","","",null,null,null,"","","",{"$f":"IF(K181=\"\", \"\", VLOOKUP(K181,Projekte!C:D,2,FALSE))","v":""}]
[null,null,null,"","",null,"","","","",null,null,null,"","","",{"$f":"IF(K182=\"\", \"\", VLOOKUP(K182,Projekte!C:D,2,FALSE))","v":""}]
[null,null,null,"","",null,"","","","",null,null,null,"","","",{"$f":"IF(K183=\"\", \"\", VLOOKUP(K183,Projekte!C:D,2,FALSE))","v":""}]
[null,null,null,"","",null,"","","","",null,null,null,"","","",{"$f":"IF(K184=\"\", \"\", VLOOKUP(K184,Projekte!C:D,2,FALSE))","v":""}]
[null,null,null,"","",null,"","","","",null,null,null,"","","",{"$f":"IF(K185=\"\", \"\", VLOOKUP(K185,Projekte!C:D,2,FALSE))","v":""}]
[null,null,null,"","",null,"","","","",null,null,null,"","","",{"$f":"IF(K186=\"\", \"\", VLOOKUP(K186,Projekte!C:D,2,FALSE))","v":""}]
[null,null,null,"","",null,"","","","",null,null,null,"","","",{"$f":"IF(K187=\"\", \"\", VLOOKUP(K187,Projekte!C:D,2,FALSE))","v":""}]
[null,null,null,"","",null,"","","","",null,null,null,"","","",{"$f":"IF(K188=\"\", \"\", VLOOKUP(K188,Projekte!C:D,2,FALSE))","v":""}]
[null,null,null,"","",null,"","","","",null,null,null,"","","",{"$f":"IF(K189=\"\", \"\", VLOOKUP(K189,Projekte!C:D,2,FALSE))","v":""}]
[null,null,null,"","",null,"","","","",null,null,null,"","","",{"$f":"IF(K190=\"\", \"\", VLOOKUP(K190,Projekte!C:D,2,FALSE))","v":""}]
[null,null,null,"","",null,"","","","",null,null,null,"","","",{"$f":"IF(K191=\"\", \"\", VLOOKUP(K191,Projekte!C:D,2,FALSE))","v":""}]
[null,null,null,"","",null,"","","","",null,null,null,"","","",{"$f":"IF(K192=\"\", \"\", VLOOKUP(K192,Projekte!C:D,2,FALSE))","v":""}]
[null,null,null,"","",null,"","","","",null,null,null,"","","",{"$f":"IF(K193=\"\", \"\", VLOOKUP(K193,Projekte!C:D,2,FALSE))","v":""}]
[null,null,null,"","",null,"","","","",null,null,null,"","","",{"$f":"IF(K194=\"\", \"\", VLOOKUP(K194,Projekte!C:D,2,FALSE))","v":""}]
[null,null,null,"","",null,"","","","",null,null,null,"","","",{"$f":"IF(K195=\"\", \"\", VLOOKUP(K195,Projekte!C:D,2,FALSE))","v":""}]
[null,null,null,"","",null,"","","","",null,null,null,"","","",{"$f":"IF(K196=\"\", \"\", VLOOKUP(K196,Projekte!C:D,2,FALSE))","v":""}]
[null,null,null,"","",null,"","","","",null,null,null,"","","",{"$f":"IF(K197=\"\", \"\", VLOOKUP(K197,Projekte!C:D,2,FALSE))","v":""}]
[null,null,null,"","",null,"","","","",null,null,null,{"$f":"IF(M198<>\"\", \"\", IF(F198 = \"\", G198, \"\"))","v":""},{"$f":"IF(M198<>\"\", \"\", IF(LOWER(F198) = \"r\",G198,\"\"))","v":""},{"$f":"IF(M198<>\"\", \"\", IF(AND(F198<>\"\", LOWER(F198) <> \"r\"),G198,\"\"))","v":""},{"$f":"IF(K198=\"\", \"\", VLOOKUP(K198,Projekte!C:D,2,FALSE))","v":""}]
[null,null,null,"","",null,"","","","",null,null,null,"","","",{"$f":"IF(K199=\"\", \"\", VLOOKUP(K199,Projekte!C:D,2,FALSE))","v":""}]
[null,null,null,"","",null,"","","","",null,null,null,"","","",{"$f":"IF(K200=\"\", \"\", VLOOKUP(K200,Projekte!C:D,2,FALSE))","v":""}]
[null,null,null,"","",null,"","","","",null,null,null,"","","",{"$f":"IF(K201=\"\", \"\", VLOOKUP(K201,Projekte!C:D,2,FALSE))","v":""}]
[null,null,null,"","",null,"","","","",null,null,null,"","","",{"$f":"IF(K202=\"\", \"\", VLOOKUP(K202,Projekte!C:D,2,FALSE))","v":""}]
[null,null,null,"","",null,{"$f":"IF(K203 = selectThisProjekt,E203, \"\")","v":""},"","","",null,null,null,"","","",{"$f":"IF(K203=\"\", \"\", VLOOKUP(K203,Projekte!C:D,2,FALSE))","v":""}]
[null,null,null,"<Ende Formeln>"]

{"sheet":"Mai","index":5,"n_rows":204,"n_cols":17,"rows_kept":204,"cut":false,"hidden":false,"merged":[[0,13,0,15],[2,0,2,2]]}
[null,null,"DL-Zeiten von",{"$f":"AssignedToCfg","v":{"$error":"#REF!"}},null,null,null,null,null,null,null,null,null,"Faktura nicht erfasst"]
["Datum","Beginn","Ende","h","h,xx","r: Reise, \nx: nicht berechnen","Summe","Dienstleistung","Reise","nicht berechnen",null,"Tätigkeit","Faktura erfasst","Dienstleistung","Reise","nicht berechnen","Projektname"]
[null,null,null,null,null,"Summe",{"$f":"SUM(G4:G203)","v":0},{"$f":"SUM(H4:H203)","v":0},{"$f":"SUM(I4:I203)","v":0},{"$f":"SUM(J4:J203)","v":0},null,"<- für diesen ProjektBereich",null,{"$f":"SUM(N4:N203)","v":0},{"$f":"SUM(O4:O203)","v":0},{"$f":"SUM(P4:P203)","v":0}]
[null,null,null,{"$f":"IF(C4=\"\", \"\", C4-B4)","v":""},{"$f":"IF(D4=\"\", \"\", (C4-B4)*24)","v":""},null,{"$f":"IF(K4 = selectThisProjekt,E4, \"\")","v":""},{"$f":"IF(F4 = \"\", G4, \"\")","v":""},{"$f":"IF(LOWER(F4) = \"r\",G4,\"\")","v":""},{"$f":"IF(AND(F4<>\"\", LOWER(F4) <> \"r\"),G4,\"\")","v":""},null,null,null,{"$f":"IF(M4<>\"\", \"\", IF(F4 = \"\", G4, \"\"))","v":""},{"$f":"IF(M4<>\"\", \"\", IF(LOWER(F4) = \"r\",G4,\"\"))","v":""},{"$f":"IF(M4<>\"\", \"\", IF(AND(F4<>\"\", LOWER(F4) <> \"r\"),G4,\"\"))","v":""},{"$f":"IF(K4=\"\", \"\", VLOOKUP(K4,Projekte!C:D,2,FALSE))","v":""}]
[null,null,null,"","",null,"",{"$f":"IF(F5 = \"\", G5, \"\")","v":""},{"$f":"IF(LOWER(F5) = \"r\",G5,\"\")","v":""},{"$f":"IF(AND(F5<>\"\", LOWER(F5) <> \"r\"),G5,\"\")","v":""},null,null,null,{"$f":"IF(M5<>\"\", \"\", IF(F5 = \"\", G5, \"\"))","v":""},{"$f":"IF(M5<>\"\", \"\", IF(LOWER(F5) = \"r\",G5,\"\"))","v":""},{"$f":"IF(M5<>\"\", \"\", IF(AND(F5<>\"\", LOWER(F5) <> \"r\"),G5,\"\"))","v":""},{"$f":"IF(K5=\"\", \"\", VLOOKUP(K5,Projekte!C:D,2,FALSE))","v":""}]
[null,null,null,"","",null,"","","","",null,null,null,{"$f":"IF(M6<>\"\", \"\", IF(F6 = \"\", G6, \"\"))","v":""},{"$f":"IF(M6<>\"\", \"\", IF(LOWER(F6) = \"r\",G6,\"\"))","v":""},{"$f":"IF(M6<>\"\", \"\", IF(AND(F6<>\"\", LOWER(F6) <> \"r\"),G6,\"\"))","v":""},{"$f":"IF(K6=\"\", \"\", VLOOKUP(K6,Projekte!C:D,2,FALSE))","v":""}]
[null,null,null,"","",null,"","","","",null,null,null,"","","",{"$f":"IF(K7=\"\", \"\", VLOOKUP(K7,Projekte!C:D,2,FALSE))","v":""}]
[null,null,null,"","",null,"","","","",null,null,null,"","","",{"$f":"IF(K8=\"\", \"\", VLOOKUP(K8,Projekte!C:D,2,FALSE))","v":""}]
[null,null,null,"","",null,"","","","",null,null,null,"","","",{"$f":"IF(K9=\"\", \"\", VLOOKUP(K9,Projekte!C:D,2,FALSE))","v":""}]
[null,null,null,"","",null,"","","","",null,null,null,"","","",{"$f":"IF(K10=\"\", \"\", VLOOKUP(K10,Projekte!C:D,2,FALSE))","v":""}]
[null,null,null,"","",null,"","","","",null,null,null,"","","",{"$f":"IF(K11=\"\", \"\", VLOOKUP(K11,Projekte!C:D,2,FALSE))","v":""}]
[null,null,null,"","",null,"","","","",null,null,null,"","","",{"$f":"IF(K12=\"\", \"\", VLOOKUP(K12,Projekte!C:D,2,FALSE))","v":""}]
[null,null,null,"","",null,"","","","",null,null,null,"","","",{"$f":"IF(K13=\"\", \"\", VLOOKUP(K13,Projekte!C:D,2,FALSE))","v":""}]
[null,null,null,"","",null,"","","","",null,null,null,"","","",{"$f":"IF(K14=\"\", \"\", VLOOKUP(K14,Projekte!C:D,2,FALSE))","v":""}]
[null,null,null,"","",null,"","","","",null,null,null,"","","",{"$f":"IF(K15=\"\", \"\", VLOOKUP(K15,Projekte!C:D,2,FALSE))","v":""}]
[null,null,null,"","",null,"","","","",null,null,null,"","","",{"$f":"IF(K16=\"\", \"\", VLOOKUP(K16,Projekte!C:D,2,FALSE))","v":""}]
[null,null,null,"","",null,"","","","",null,null,null,"","","",{"$f":"IF(K17=\"\", \"\", VLOOKUP(K17,Projekte!C:D,2,FALSE))","v":""}]
[null,null,null,"","",null,"","","","",null,null,null,"","","",{"$f":"IF(K18=\"\", \"\", VLOOKUP(K18,Projekte!C:D,2,FALSE))","v":""}]
[null,null,null,"","",null,"","","","",null,null,null,"","","",{"$f":"IF(K19=\"\", \"\", VLOOKUP(K19,Projekte!C:D,2,FALSE))","v":""}]
[null,null,null,"","",null,"","","","",null,null,null,"","","",{"$f":"IF(K20=\"\", \"\", VLOOKUP(K20,Projekte!C:D,2,FALSE))","v":""}]
[null,null,null,"","",null,"","","","",null,null,null,"","","",{"$f":"IF(K21=\"\", \"\", VLOOKUP(K21,Projekte!C:D,2,FALSE))","v":""}]
[null,null,null,"","",null,"","","","",null,null,null,"","","",{"$f":"IF(K22=\"\", \"\", VLOOKUP(K22,Projekte!C:D,2,FALSE))","v":""}]
[null,null,null,"","",null,"","","","",null,null,null,"","","",{"$f":"IF(K23=\"\", \"\", VLOOKUP(K23,Projekte!C:D,2,FALSE))","v":""}]
[null,null,null,"","",null,"","","","",null,null,null,"","","",{"$f":"IF(K24=\"\", \"\", VLOOKUP(K24,Projekte!C:D,2,FALSE))","v":""}]
[null,null,null,"","",null,"","","","",null,null,null,"","","",{"$f":"IF(K25=\"\", \"\", VLOOKUP(K25,Projekte!C:D,2,FALSE))","v":""}]
[null,null,null,"","",null,"","","","",null,null,null,"","","",{"$f":"IF(K26=\"\", \"\", VLOOKUP(K26,Projekte!C:D,2,FALSE))","v":""}]
[null,null,null,"","",null,"","","","",null,null,null,"","","",{"$f":"IF(K27=\"\", \"\", VLOOKUP(K27,Projekte!C:D,2,FALSE))","v":""}]
[null,null,null,"","",null,"","","","",null,null,null,"","","",{"$f":"IF(K28=\"\", \"\", VLOOKUP(K28,Projekte!C:D,2,FALSE))","v":""}]
[null,null,null,"","",null,"","","","",null,null,null,"","","",{"$f":"IF(K29=\"\", \"\", VLOOKUP(K29,Projekte!C:D,2,FALSE))","v":""}]
[null,null,null,"","",null,"","","","",null,null,null,"","","",{"$f":"IF(K30=\"\", \"\", VLOOKUP(K30,Projekte!C:D,2,FALSE))","v":""}]
[null,null,null,"","",null,"","","","",null,null,null,"","","",{"$f":"IF(K31=\"\", \"\", VLOOKUP(K31,Projekte!C:D,2,FALSE))","v":""}]
[null,null,null,"","",null,"","","","",null,null,null,"","","",{"$f":"IF(K32=\"\", \"\", VLOOKUP(K32,Projekte!C:D,2,FALSE))","v":""}]
[null,null,null,"","",null,"","","","",null,null,null,"","","",{"$f":"IF(K33=\"\", \"\", VLOOKUP(K33,Projekte!C:D,2,FALSE))","v":""}]
[null,null,null,"","",null,"","","","",null,null,null,"","","",{"$f":"IF(K34=\"\", \"\", VLOOKUP(K34,Projekte!C:D,2,FALSE))","v":""}]
[null,null,null,"","",null,"","","","",null,null,null,"","","",{"$f":"IF(K35=\"\", \"\", VLOOKUP(K35,Projekte!C:D,2,FALSE))","v":""}]
[null,null,null,"","",null,{"$f":"IF(K36 = selectThisProjekt,E36, \"\")","v":""},"","","",null,null,null,"","","",{"$f":"IF(K36=\"\", \"\", VLOOKUP(K36,Projekte!C:D,2,FALSE))","v":""}]
[null,null,null,"","",null,"","","","",null,null,null,"","","",{"$f":"IF(K37=\"\", \"\", VLOOKUP(K37,Projekte!C:D,2,FALSE))","v":""}]
[null,null,null,"","",null,"","","","",null,null,null,"","","",{"$f":"IF(K38=\"\", \"\", VLOOKUP(K38,Projekte!C:D,2,FALSE))","v":""}]
[null,null,null,"","",null,"","","","",null,null,null,"","","",{"$f":"IF(K39=\"\", \"\", VLOOKUP(K39,Projekte!C:D,2,FALSE))","v":""}]
[null,null,null,"","",null,"","","","",null,null,null,"","","",{"$f":"IF(K40=\"\", \"\", VLOOKUP(K40,Projekte!C:D,2,FALSE))","v":""}]
[null,null,null,"","",null,"","","","",null,null,null,"","","",{"$f":"IF(K41=\"\", \"\", VLOOKUP(K41,Projekte!C:D,2,FALSE))","v":""}]
[null,null,null,"","",null,"","","","",null,null,null,"","","",{"$f":"IF(K42=\"\", \"\", VLOOKUP(K42,Projekte!C:D,2,FALSE))","v":""}]
[null,null,null,"","",null,"","","","",null,null,null,"","","",{"$f":"IF(K43=\"\", \"\", VLOOKUP(K43,Projekte!C:D,2,FALSE))","v":""}]
[null,null,null,"","",null,"","","","",null,null,null,"","","",{"$f":"IF(K44=\"\", \"\", VLOOKUP(K44,Projekte!C:D,2,FALSE))","v":""}]
[null,null,null,"","",null,"","","","",null,null,null,"","","",{"$f":"IF(K45=\"\", \"\", VLOOKUP(K45,Projekte!C:D,2,FALSE))","v":""}]
[null,null,null,"","",null,"","","","",null,null,null,"","","",{"$f":"IF(K46=\"\", \"\", VLOOKUP(K46,Projekte!C:D,2,FALSE))","v":""}]
[null,null,null,"","",null,"","","","",null,null,null,"","","",{"$f":"IF(K47=\"\", \"\", VLOOKUP(K47,Projekte!C:D,2,FALSE))","v":""}]
[null,null,null,"","",null,"","","","",null,null,null,"","","",{"$f":"IF(K48=\"\", \"\", VLOOKUP(K48,Projekte!C:D,2,FALSE))","v":""}]
[null,null,null,"","",null,"","","","",null,null,null,"","","",{"$f":"IF(K49=\"\", \"\", VLOOKUP(K49,Projekte!C:D,2,FALSE))","v":""}]
[null,null,null,"","",null,"","","","",null,null,null,"","","",{"$f":"IF(K50=\"\", \"\", VLOOKUP(K50,Projekte!C:D,2,FALSE))","v":""}]
[null,null,null,"","",null,"","","","",null,null,null,{"$f":"IF(M51<>\"\", \"\", IF(F51 = \"\", G51, \"\"))","v":""},{"$f":"IF(M51<>\"\", \"\", IF(LOWER(F51) = \"r\",G51,\"\"))","v":""},{"$f":"IF(M51<>\"\", \"\", IF(AND(F51<>\"\", LOWER(F51) <> \"r\"),G51,\"\"))","v":""},{"$f":"IF(K51=\"\", \"\", VLOOKUP(K51,Projekte!C:D,2,FALSE))","v":""}]
[null,null,null,"","",null,"","","","",null,null,null,"","","",{"$f":"IF(K52=\"\", \"\", VLOOKUP(K52,Projekte!C:D,2,FALSE))","v":""}]
[null,null,null,"","",null,"","","","",null,null,null,"","","",{"$f":"IF(K53=\"\", \"\", VLOOKUP(K53,Projekte!C:D,2,FALSE))","v":""}]
[null,null,null,"","",null,"","","","",null,null,null,"","","",{"$f":"IF(K54=\"\", \"\", VLOOKUP(K54,Projekte!C:D,2,FALSE))","v":""}]
[null,null,null,"","",null,"","","","",null,null,null,"","","",{"$f":"IF(K55=\"\", \"\", VLOOKUP(K55,Projekte!C:D,2,FALSE))","v":""}]
[null,null,null,"","",null,"","","","",null,null,null,"","","",{"$f":"IF(K56=\"\", \"\", VLOOKUP(K56,Projekte!C:D,2,FALSE))","v":""}]
[null,null,null,"","",null,"","","","",null,null,null,"","","",{"$f":"IF(K57=\"\", \"\", VLOOKUP(K57,Projekte!C:D,2,FALSE))","v":""}]
[null,null,null,"","",null,"","","","",null,null,null,"","","",{"$f":"IF(K58=\"\", \"\", VLOOKUP(K58,Projekte!C:D,2,FALSE))","v":""}]
[null,null,null,"","",null,"","","","",null,null,null,"","","",{"$f":"IF(K59=\"\", \"\", VLOOKUP(K59,Projekte!C:D,2,FALSE))","v":""}]
[null,null,null,"","",null,"","","","",null,null,null,"","","",{"$f":"IF(K60=\"\", \"\", VLOOKUP(K60,Projekte!C:D,2,FALSE))","v":""}]
[null,null,null,"","",null,"","","","",null,null,null,"","","",{"$f":"IF(K61=\"\", \"\", VLOOKUP(K61,Projekte!C:D,2,FALSE))","v":""}]
[null,null,null,"","",null,"","","","",null,null,null,"","","",{"$f":"IF(K62=\"\", \"\", VLOOKUP(K62,Projekte!C:D,2,FALSE))","v":""}]
[null,null,null,"","",null,"","","","",null,null,null,"","","",{"$f":"IF(K63=\"\", \"\", VLOOKUP(K63,Projekte!C:D,2,FALSE))","v":""}]
[null,null,null,"","",null,"","","","",null,null,null,"","","",{"$f":"IF(K64=\"\", \"\", VLOOKUP(K64,Projekte!C:D,2,FALSE))","v":""}]
[null,null,null,"","",null,"","","","",null,null,null,"","","",{"$f":"IF(K65=\"\", \"\", VLOOKUP(K65,Projekte!C:D,2,FALSE))","v":""}]
[null,null,null,"","",null,"","","","",null,null,null,"","","",{"$f":"IF(K66=\"\", \"\", VLOOKUP(K66,Projekte!C:D,2,FALSE))","v":""}]
[null,null,null,"","",null,"","","","",null,null,null,"","","",{"$f":"IF(K67=\"\", \"\", VLOOKUP(K67,Projekte!C:D,2,FALSE))","v":""}]
[null,null,null,{"$f":"IF(C68=\"\", \"\", C68-B68)","v":""},{"$f":"IF(D68=\"\", \"\", (C68-B68)*24)","v":""},null,{"$f":"IF(K68 = selectThisProjekt,E68, \"\")","v":""},"","","",null,null,null,"","","",{"$f":"IF(K68=\"\", \"\", VLOOKUP(K68,Projekte!C:D,2,FALSE))","v":""}]
[null,null,null,"","",null,"",{"$f":"IF(F69 = \"\", G69, \"\")","v":""},{"$f":"IF(LOWER(F69) = \"r\",G69,\"\")","v":""},{"$f":"IF(AND(F69<>\"\", LOWER(F69) <> \"r\"),G69,\"\")","v":""},null,null,null,"","","",{"$f":"IF(K69=\"\", \"\", VLOOKUP(K69,Projekte!C:D,2,FALSE))","v":""}]
[null,null,null,"","",null,"","","","",null,null,null,{"$f":"IF(M70<>\"\", \"\", IF(F70 = \"\", G70, \"\"))","v":""},{"$f":"IF(M70<>\"\", \"\", IF(LOWER(F70) = \"r\",G70,\"\"))","v":""},{"$f":"IF(M70<>\"\", \"\", IF(AND(F70<>\"\", LOWER(F70) <> \"r\"),G70,\"\"))","v":""},{"$f":"IF(K70=\"\", \"\", VLOOKUP(K70,Projekte!C:D,2,FALSE))","v":""}]
[null,null,null,"","",null,"","","","",null,null,null,"","","",{"$f":"IF(K71=\"\", \"\", VLOOKUP(K71,Projekte!C:D,2,FALSE))","v":""}]
[null,null,null,"","",null,"","","","",null,null,null,"","","",{"$f":"IF(K72=\"\", \"\", VLOOKUP(K72,Projekte!C:D,2,FALSE))","v":""}]
[null,null,null,"","",null,"","","","",null,null,null,"","","",{"$f":"IF(K73=\"\", \"\", VLOOKUP(K73,Projekte!C:D,2,FALSE))","v":""}]
[null,null,null,"","",null,"","","","",null,null,null,"","","",{"$f":"IF(K74=\"\", \"\", VLOOKUP(K74,Projekte!C:D,2,FALSE))","v":""}]
[null,null,null,"","",null,"","","","",null,null,null,"","","",{"$f":"IF(K75=\"\", \"\", VLOOKUP(K75,Projekte!C:D,2,FALSE))","v":""}]
[null,null,null,"","",null,"","","","",null,null,null,"","","",{"$f":"IF(K76=\"\", \"\", VLOOKUP(K76,Projekte!C:D,2,FALSE))","v":""}]
[null,null,null,"","",null,"","","","",null,null,null,"","","",{"$f":"IF(K77=\"\", \"\", VLOOKUP(K77,Projekte!C:D,2,FALSE))","v":""}]
[null,null,null,"","",null,"","","","",null,null,null,"","","",{"$f":"IF(K78=\"\", \"\", VLOOKUP(K78,Projekte!C:D,2,FALSE))","v":""}]
[null,null,null,"","",null,"","","","",null,null,null,"","","",{"$f":"IF(K79=\"\", \"\", VLOOKUP(K79,Projekte!C:D,2,FALSE))","v":""}]
[null,null,null,"","",null,"","","","",null,null,null,"","","",{"$f":"IF(K80=\"\", \"\", VLOOKUP(K80,Projekte!C:D,2,FALSE))","v":""}]
[null,null,null,"","",null,"","","","",null,null,null,"","","",{"$f":"IF(K81=\"\", \"\", VLOOKUP(K81,Projekte!C:D,2,FALSE))","v":""}]
[null,null,null,"","",null,"","","","",null,null,null,"","","",{"$f":"IF(K82=\"\", \"\", VLOOKUP(K82,Projekte!C:D,2,FALSE))","v":""}]
[null,null,null,"","",null,"","","","",null,null,null,"","","",{"$f":"IF(K83=\"\", \"\", VLOOKUP(K83,Projekte!C:D,2,FALSE))","v":""}]
[null,null,null,"","",null,"","","","",null,null,null,"","","",{"$f":"IF(K84=\"\", \"\", VLOOKUP(K84,Projekte!C:D,2,FALSE))","v":""}]
[null,null,null,"","",null,"","","","",null,null,null,"","","",{"$f":"IF(K85=\"\", \"\", VLOOKUP(K85,Projekte!C:D,2,FALSE))","v":""}]
[null,null,null,"","",null,"","","","",null,null,null,"","","",{"$f":"IF(K86=\"\", \"\", VLOOKUP(K86,Projekte!C:D,2,FALSE))","v":""}]
[null,null,null,"","",null,"","","","",null,null,null,"","","",{"$f":"IF(K87=\"\", \"\", VLOOKUP(K87,Projekte!C:D,2,FALSE))","v":""}]
[null,null,null,"","",null,"","","","",null,null,null,"","","",{"$f":"IF(K88=\"\", \"\", VLOOKUP(K88,Projekte!C:D,2,FALSE))","v":""}]
[null,null,null,"","",null,"","","","",null,null,null,"","","",{"$f":"IF(K89=\"\", \"\", VLOOKUP(K89,Projekte!C:D,2,FALSE))","v":""}]
[null,null,null,"","",null,"","","","",null,null,null,"","","",{"$f":"IF(K90=\"\", \"\", VLOOKUP(K90,Projekte!C:D,2,FALSE))","v":""}]
[null,null,null,"","",null,"","","","",null,null,null,"","","",{"$f":"IF(K91=\"\", \"\", VLOOKUP(K91,Projekte!C:D,2,FALSE))","v":""}]
[null,null,null,"","",null,"","","","",null,null,null,"","","",{"$f":"IF(K92=\"\", \"\", VLOOKUP(K92,Projekte!C:D,2,FALSE))","v":""}]
[null,null,null,"","",null,"","","","",null,null,null,"","","",{"$f":"IF(K93=\"\", \"\", VLOOKUP(K93,Projekte!C:D,2,FALSE))","v":""}]
[null,null,null,"","",null,"","","","",null,null,null,"","","",{"$f":"IF(K94=\"\", \"\", VLOOKUP(K94,Projekte!C:D,2,FALSE))","v":""}]
[null,null,null,"","",null,"","","","",null,null,null,"","","",{"$f":"IF(K95=\"\", \"\", VLOOKUP(K95,Projekte!C:D,2,FALSE))","v":""}]
[null,null,null,"","",null,"","","","",null,null,null,"","","",{"$f":"IF(K96=\"\", \"\", VLOOKUP(K96,Projekte!C:D,2,FALSE))","v":""}]
[null,null,null,"","",null,"","","","",null,null,null,"","","",{"$f":"IF(K97=\"\", \"\", VLOOKUP(K97,Projekte!C:D,2,FALSE))","v":""}]
[null,null,null,"","",null,"","","","",null,null,null,"","","",{"$f":"IF(K98=\"\", \"\", VLOOKUP(K98,Projekte!C:D,2,FALSE))","v":""}]
[null,null,null,"","",null,"","","","",null,null,null,"","","",{"$f":"IF(K99=\"\", \"\", VLOOKUP(K99,Projekte!C:D,2,FALSE))","v":""}]
[null,null,null,"","",null,{"$f":"IF(K100 = selectThisProjekt,E100, \"\")","v":""},"","","",null,null,null,"","","",{"$f":"IF(K100=\"\", \"\", VLOOKUP(K100,Projekte!C:D,2,FALSE))","v":""}]
[null,null,null,"","",null,"","","","",null,null,null,"","","",{"$f":"IF(K101=\"\", \"\", VLOOKUP(K101,Projekte!C:D,2,FALSE))","v":""}]
[null,null,null,"","",null,"","","","",null,null,null,"","","",{"$f":"IF(K102=\"\", \"\", VLOOKUP(K102,Projekte!C:D,2,FALSE))","v":""}]
[null,null,null,"","",null,"","","","",null,null,null,"","","",{"$f":"IF(K103=\"\", \"\", VLOOKUP(K103,Projekte!C:D,2,FALSE))","v":""}]
[null,null,null,"","",null,"","","","",null,null,null,"","","",{"$f":"IF(K104=\"\", \"\", VLOOKUP(K104,Projekte!C:D,2,FALSE))","v":""}]
[null,null,null,"","",null,"","","","",null,null,null,"","","",{"$f":"IF(K105=\"\", \"\", VLOOKUP(K105,Projekte!C:D,2,FALSE))","v":""}]
[null,null,null,"","",null,"","","","",null,null,null,"","","",{"$f":"IF(K106=\"\", \"\", VLOOKUP(K106,Projekte!C:D,2,FALSE))","v":""}]
[null,null,null,"","",null,"","","","",null,null,null,"","","",{"$f":"IF(K107=\"\", \"\", VLOOKUP(K107,Projekte!C:D,2,FALSE))","v":""}]
[null,null,null,"","",null,"","","","",null,null,null,"","","",{"$f":"IF(K108=\"\", \"\", VLOOKUP(K108,Projekte!C:D,2,FALSE))","v":""}]
[null,null,null,"","",null,"","","","",null,null,null,"","","",{"$f":"IF(K109=\"\", \"\", VLOOKUP(K109,Projekte!C:D,2,FALSE))","v":""}]
[null,null,null,"","",null,"","","","",null,null,null,"","","",{"$f":"IF(K110=\"\", \"\", VLOOKUP(K110,Projekte!C:D,2,FALSE))","v":""}]
[null,null,null,"","",null,"","","","",null,null,null,"","","",{"$f":"IF(K111=\"\", \"\", VLOOKUP(K111,Projekte!C:D,2,FALSE))","v":""}]
[null,null,null,"","",null,"","","","",null,null,null,"","","",{"$f":"IF(K112=\"\", \"\", VLOOKUP(K112,Projekte!C:D,2,FALSE))","v":""}]
[null,null,null,"","",null,"","","","",null,null,null,"","","",{"$f":"IF(K113=\"\", \"\", VLOOKUP(K113,Projekte!C:D,2,FALSE))","v":""}]
[null,null,null,"","",null,"","","","",null,null,null,"","","",{"$f":"IF(K114=\"\", \"\", VLOOKUP(K114,Projekte!C:D,2,FALSE))","v":""}]
[null,null,null,"","",null,"","","","",null,null,null,"","","",{"$f":"IF(K115=\"\", \"\", VLOOKUP(K115,Projekte!C:D,2,FALSE))","v":""}]
[null,null,null,"","",null,"","","","",null,null,null,"","","",{"$f":"IF(K116=\"\", \"\", VLOOKUP(K116,Projekte!C:D,2,FALSE))","v":""}]
[null,null,null,"","",null,"","","","",null,null,null,"","","",{"$f":"IF(K117=\"\", \"\", VLOOKUP(K117,Projekte!C:D,2,FALSE))","v":""}]
[null,null,null,"","",null,"","","","",null,null,null,"","","",{"$f":"IF(K118=\"\", \"\", VLOOKUP(K118,Projekte!C:D,2,FALSE))","v":""}]
[null,null,null,"","",null,"","","","",null,null,null,"","","",{"$f":"IF(K119=\"\", \"\", VLOOKUP(K119,Projekte!C:D,2,FALSE))","v":""}]
[null,null,null,"","",null,"","","","",null,null,null,"","","",{"$f":"IF(K120=\"\", \"\", VLOOKUP(K120,Projekte!C:D,2,FALSE))","v":""}]
[null,null,null,"","",null,"","","","",null,null,null,"","","",{"$f":"IF(K121=\"\", \"\", VLOOKUP(K121,Projekte!C:D,2,FALSE))","v":""}]
[null,null,null,"","",null,"","","","",null,null,null,"","","",{"$f":"IF(K122=\"\", \"\", VLOOKUP(K122,Projekte!C:D,2,FALSE))","v":""}]
[null,null,null,"","",null,{"$f":"IF(K123 = selectThisProjekt,E123, \"\")","v":""},"","","",null,null,null,"","","",{"$f":"IF(K123=\"\", \"\", VLOOKUP(K123,Projekte!C:D,2,FALSE))","v":""}]
[null,null,null,"","",null,"","","","",null,null,null,"","","",{"$f":"IF(K124=\"\", \"\", VLOOKUP(K124,Projekte!C:D,2,FALSE))","v":""}]
[null,null,null,"","",null,{"$f":"IF(K125 = selectThisProjekt,E125, \"\")","v":""},"","","",null,null,null,"","","",{"$f":"IF(K125=\"\", \"\", VLOOKUP(K125,Projekte!C:D,2,FALSE))","v":""}]
[null,null,null,"","",null,"","","","",null,null,null,"","","",{"$f":"IF(K126=\"\", \"\", VLOOKUP(K126,Projekte!C:D,2,FALSE))","v":""}]
[null,null,null,"","",null,"","","","",null,null,null,"","","",{"$f":"IF(K127=\"\", \"\", VLOOKUP(K127,Projekte!C:D,2,FALSE))","v":""}]
[null,null,null,"","",null,"","","","",null,null,null,"","","",{"$f":"IF(K128=\"\", \"\", VLOOKUP(K128,Projekte!C:D,2,FALSE))","v":""}]
[null,null,null,"","",null,"","","","",null,null,null,"","","",{"$f":"IF(K129=\"\", \"\", VLOOKUP(K129,Projekte!C:D,2,FALSE))","v":""}]
[null,null,null,"","",null,"","","","",null,null,null,"","","",{"$f":"IF(K130=\"\", \"\", VLOOKUP(K130,Projekte!C:D,2,FALSE))","v":""}]
[null,null,null,"","",null,"","","","",null,null,null,"","","",{"$f":"IF(K131=\"\", \"\", VLOOKUP(K131,Projekte!C:D,2,FALSE))","v":""}]
[null,null,null,{"$f":"IF(C132=\"\", \"\", C132-B132)","v":""},{"$f":"IF(D132=\"\", \"\", (C132-B132)*24)","v":""},null,{"$f":"IF(K132 = selectThisProjekt,E132, \"\")","v":""},"","","",null,null,null,"","","",{"$f":"IF(K132=\"\", \"\", VLOOKUP(K132,Projekte!C:D,2,FALSE))","v":""}]
[null,null,null,"","",null,"",{"$f":"IF(F133 = \"\", G133, \"\")","v":""},{"$f":"IF(LOWER(F133) = \"r\",G133,\"\")","v":""},{"$f":"IF(AND(F133<>\"\", LOWER(F133) <> \"r\"),G133,\"\")","v":""},null,null,null,"","","",{"$f":"IF(K133=\"\", \"\", VLOOKUP(K133,Projekte!C:D,2,FALSE))","v":""}]
[null,null,null,"","",null,"","","","",null,null,null,{"$f":"IF(M134<>\"\", \"\", IF(F134 = \"\", G134, \"\"))","v":""},{"$f":"IF(M134<>\"\", \"\", IF(LOWER(F134) = \"r\",G134,\"\"))","v":""},{"$f":"IF(M134<>\"\", \"\", IF(AND(F134<>\"\", LOWER(F134) <> \"r\"),G134,\"\"))","v":""},{"$f":"IF(K134=\"\", \"\", VLOOKUP(K134,Projekte!C:D,2,FALSE))","v":""}]
[null,null,null,"","",null,"","","","",null,null,null,"","","",{"$f":"IF(K135=\"\", \"\", VLOOKUP(K135,Projekte!C:D,2,FALSE))","v":""}]
[null,null,null,"","",null,"","","","",null,null,null,"","","",{"$f":"IF(K136=\"\", \"\", VLOOKUP(K136,Projekte!C:D,2,FALSE))","v":""}]
[null,null,null,"","",null,"","","","",null,null,null,"","","",{"$f":"IF(K137=\"\", \"\", VLOOKUP(K137,Projekte!C:D,2,FALSE))","v":""}]
[null,null,null,"","",null,"","","","",null,null,null,"","","",{"$f":"IF(K138=\"\", \"\", VLOOKUP(K138,Projekte!C:D,2,FALSE))","v":""}]
[null,null,null,"","",null,"","","","",null,null,null,"","","",{"$f":"IF(K139=\"\", \"\", VLOOKUP(K139,Projekte!C:D,2,FALSE))","v":""}]
[null,null,null,"","",null,"","","","",null,null,null,"","","",{"$f":"IF(K140=\"\", \"\", VLOOKUP(K140,Projekte!C:D,2,FALSE))","v":""}]
[null,null,null,"","",null,"","","","",null,null,null,"","","",{"$f":"IF(K141=\"\", \"\", VLOOKUP(K141,Projekte!C:D,2,FALSE))","v":""}]
[null,null,null,"","",null,"","","","",null,null,null,"","","",{"$f":"IF(K142=\"\", \"\", VLOOKUP(K142,Projekte!C:D,2,FALSE))","v":""}]
[null,null,null,"","",null,"","","","",null,null,null,"","","",{"$f":"IF(K143=\"\", \"\", VLOOKUP(K143,Projekte!C:D,2,FALSE))","v":""}]
[null,null,null,"","",null,"","","","",null,null,null,"","","",{"$f":"IF(K144=\"\", \"\", VLOOKUP(K144,Projekte!C:D,2,FALSE))","v":""}]
[null,null,null,"","",null,"","","","",null,null,null,"","","",{"$f":"IF(K145=\"\", \"\", VLOOKUP(K145,Projekte!C:D,2,FALSE))","v":""}]
[null,null,null,"","",null,"","","","",null,null,null,"","","",{"$f":"IF(K146=\"\", \"\", VLOOKUP(K146,Projekte!C:D,2,FALSE))","v":""}]
[null,null,null,"","",null,"","","","",null,null,null,"","","",{"$f":"IF(K147=\"\", \"\", VLOOKUP(K147,Projekte!C:D,2,FALSE))","v":""}]
[null,null,null,"","",null,"","","","",null,null,null,"","","",{"$f":"IF(K148=\"\", \"\", VLOOKUP(K148,Projekte!C:D,2,FALSE))","v":""}]
[null,null,null,"","",null,"","","","",null,null,null,"","","",{"$f":"IF(K149=\"\", \"\", VLOOKUP(K149,Projekte!C:D,2,FALSE))","v":""}]
[null,null,null,"","",null,"","","","",null,null,null,"","","",{"$f":"IF(K150=\"\", \"\", VLOOKUP(K150,Projekte!C:D,2,FALSE))","v":""}]
[null,null,null,"","",null,"","","","",null,null,null,"","","",{"$f":"IF(K151=\"\", \"\", VLOOKUP(K151,Projekte!C:D,2,FALSE))","v":""}]
[null,null,null,"","",null,"","","","",null,null,null,"","","",{"$f":"IF(K152=\"\", \"\", VLOOKUP(K152,Projekte!C:D,2,FALSE))","v":""}]
[null,null,null,"","",null,"","","","",null,null,null,"","","",{"$f":"IF(K153=\"\", \"\", VLOOKUP(K153,Projekte!C:D,2,FALSE))","v":""}]
[null,null,null,"","",null,"","","","",null,null,null,"","","",{"$f":"IF(K154=\"\", \"\", VLOOKUP(K154,Projekte!C:D,2,FALSE))","v":""}]
[null,null,null,"","",null,"","","","",null,null,null,"","","",{"$f":"IF(K155=\"\", \"\", VLOOKUP(K155,Projekte!C:D,2,FALSE))","v":""}]
[null,null,null,"","",null,"","","","",null,null,null,"","","",{"$f":"IF(K156=\"\", \"\", VLOOKUP(K156,Projekte!C:D,2,FALSE))","v":""}]
[null,null,null,"","",null,"","","","",null,null,null,"","","",{"$f":"IF(K157=\"\", \"\", VLOOKUP(K157,Projekte!C:D,2,FALSE))","v":""}]
[null,null,null,"","",null,"","","","",null,null,null,"","","",{"$f":"IF(K158=\"\", \"\", VLOOKUP(K158,Projekte!C:D,2,FALSE))","v":""}]
[null,null,null,"","",null,"","","","",null,null,null,"","","",{"$f":"IF(K159=\"\", \"\", VLOOKUP(K159,Projekte!C:D,2,FALSE))","v":""}]
[null,null,null,"","",null,"","","","",null,null,null,"","","",{"$f":"IF(K160=\"\", \"\", VLOOKUP(K160,Projekte!C:D,2,FALSE))","v":""}]
[null,null,null,"","",null,"","","","",null,null,null,"","","",{"$f":"IF(K161=\"\", \"\", VLOOKUP(K161,Projekte!C:D,2,FALSE))","v":""}]
[null,null,null,"","",null,"","","","",null,null,null,"","","",{"$f":"IF(K162=\"\", \"\", VLOOKUP(K162,Projekte!C:D,2,FALSE))","v":""}]
[null,null,null,"","",null,"","","","",null,null,null,"","","",{"$f":"IF(K163=\"\", \"\", VLOOKUP(K163,Projekte!C:D,2,FALSE))","v":""}]
[null,null,null,"","",null,{"$f":"IF(K164 = selectThisProjekt,E164, \"\")","v":""},"","","",null,null,null,"","","",{"$f":"IF(K164=\"\", \"\", VLOOKUP(K164,Projekte!C:D,2,FALSE))","v":""}]
[null,null,null,"","",null,"","","","",null,null,null,"","","",{"$f":"IF(K165=\"\", \"\", VLOOKUP(K165,Projekte!C:D,2,FALSE))","v":""}]
[null,null,null,"","",null,"","","","",null,null,null,"","","",{"$f":"IF(K166=\"\", \"\", VLOOKUP(K166,Projekte!C:D,2,FALSE))","v":""}]
[null,null,null,"","",null,"","","","",null,null,null,"","","",{"$f":"IF(K167=\"\", \"\", VLOOKUP(K167,Projekte!C:D,2,FALSE))","v":""}]
[null,null,null,"","",null,"","","","",null,null,null,"","","",{"$f":"IF(K168=\"\", \"\", VLOOKUP(K168,Projekte!C:D,2,FALSE))","v":""}]
[null,null,null,"","",null,"","","","",null,null,null,"","","",{"$f":"IF(K169=\"\", \"\", VLOOKUP(K169,Projekte!C:D,2,FALSE))","v":""}]
[null,null,null,"","",null,{"$f":"IF(K170 = selectThisProjekt,E170, \"\")","v":""},"","","",null,null,null,"","","",{"$f":"IF(K170=\"\", \"\", VLOOKUP(K170,Projekte!C:D,2,FALSE))","v":""}]
[null,null,null,"","",null,"","","","",null,null,null,"","","",{"$f":"IF(K171=\"\", \"\", VLOOKUP(K171,Projekte!C:D,2,FALSE))","v":""}]
[null,null,null,"","",null,"","","","",null,null,null,"","","",{"$f":"IF(K172=\"\", \"\", VLOOKUP(K172,Projekte!C:D,2,FALSE))","v":""}]
[null,null,null,"","",null,"","","","",null,null,null,"","","",{"$f":"IF(K173=\"\", \"\", VLOOKUP(K173,Projekte!C:D,2,FALSE))","v":""}]
[null,null,null,"","",null,"","","","",null,null,null,"","","",{"$f":"IF(K174=\"\", \"\", VLOOKUP(K174,Projekte!C:D,2,FALSE))","v":""}]
[null,null,null,"","",null,"","","","",null,null,null,"","","",{"$f":"IF(K175=\"\", \"\", VLOOKUP(K175,Projekte!C:D,2,FALSE))","v":""}]
[null,null,null,"","",null,"","","","",null,null,null,"","","",{"$f":"IF(K176=\"\", \"\", VLOOKUP(K176,Projekte!C:D,2,FALSE))","v":""}]
[null,null,null,"","",null,"","","","",null,null,null,"","","",{"$f":"IF(K177=\"\", \"\", VLOOKUP(K177,Projekte!C:D,2,FALSE))","v":""}]
[null,null,null,"","",null,"","","","",null,null,null,"","","",{"$f":"IF(K178=\"\", \"\", VLOOKUP(K178,Projekte!C:D,2,FALSE))","v":""}]
[null,null,null,"","",null,"","","","",null,null,null,"","","",{"$f":"IF(K179=\"\", \"\", VLOOKUP(K179,Projekte!C:D,2,FALSE))","v":""}]
[null,null,null,"","",null,"","","","",null,null,null,"","","",{"$f":"IF(K180=\"\", \"\", VLOOKUP(K180,Projekte!C:D,2,FALSE))","v":""}]
[null,null,null,"","",null,"","","","",null,null,null,"","","",{"$f":"IF(K181=\"\", \"\", VLOOKUP(K181,Projekte!C:D,2,FALSE))","v":""}]
[null,null,null,"","",null,"","","","",null,null,null,"","","",{"$f":"IF(K182=\"\", \"\", VLOOKUP(K182,Projekte!C:D,2,FALSE))","v":""}]
[null,null,null,"","",null,"","","","",null,null,null,"","","",{"$f":"IF(K183=\"\", \"\", VLOOKUP(K183,Projekte!C:D,2,FALSE))","v":""}]
[null,null,null,"","",null,"","","","",null,null,null,"","","",{"$f":"IF(K184=\"\", \"\", VLOOKUP(K184,Projekte!C:D,2,FALSE))","v":""}]
[null,null,null,"","",null,"","","","",null,null,null,"","","",{"$f":"IF(K185=\"\", \"\", VLOOKUP(K185,Projekte!C:D,2,FALSE))","v":""}]
[null,null,null,"","",null,"","","","",null,null,null,"","","",{"$f":"IF(K186=\"\", \"\", VLOOKUP(K186,Projekte!C:D,2,FALSE))","v":""}]
[null,null,null,"","",null,"","","","",null,null,null,"","","",{"$f":"IF(K187=\"\", \"\", VLOOKUP(K187,Projekte!C:D,2,FALSE))","v":""}]
[null,null,null,"","",null,"","","","",null,null,null,"","","",{"$f":"IF(K188=\"\", \"\", VLOOKUP(K188,Projekte!C:D,2,FALSE))","v":""}]
[null,null,null,"","",null,"","","","",null,null,null,"","","",{"$f":"IF(K189=\"\", \"\", VLOOKUP(K189,Projekte!C:D,2,FALSE))","v":""}]
[null,null,null,"","",null,"","","","",null,null,null,"","","",{"$f":"IF(K190=\"\", \"\", VLOOKUP(K190,Projekte!C:D,2,FALSE))","v":""}]
[null,null,null,"","",null,"","","","",null,null,null,"","","",{"$f":"IF(K191=\"\", \"\", VLOOKUP(K191,Projekte!C:D,2,FALSE))","v":""}]
[null,null,null,"","",null,"","","","",null,null,null,"","","",{"$f":"IF(K192=\"\", \"\", VLOOKUP(K192,Projekte!C:D,2,FALSE))","v":""}]
[null,null,null,"","",null,"","","","",null,null,null,"","","",{"$f":"IF(K193=\"\", \"\", VLOOKUP(K193,Projekte!C:D,2,FALSE))","v":""}]
[null,null,null,"","",null,"","","","",null,null,null,"","","",{"$f":"IF(K194=\"\", \"\", VLOOKUP(K194,Projekte!C:D,2,FALSE))","v":""}]
[null,null,null,"","",null,"","","","",null,null,null,"","","",{"$f":"IF(K195=\"\", \"\", VLOOKUP(K195,Projekte!C:D,2,FALSE))","v":""}]
[null,null,null,"","",null,"","","","",null,null,null,"","","",{"$f":"IF(K196=\"\", \"\", VLOOKUP(K196,Projekte!C:D,2,FALSE))","v":""}]
[null,null,null,"","",null,"","","","",null,null,null,"","","",{"$f":"IF(K197=\"\", \"\", VLOOKUP(K197,Projekte!C:D,2,FALSE))","v":""}]
[null,null,null,"","",null,"","","","",null,null,null,{"$f":"IF(M198<>\"\", \"\", IF(F198 = \"\", G198, \"\"))","v":""},{"$f":"IF(M198<>\"\", \"\", IF(LOWER(F198) = \"r\",G198,\"\"))","v":""},{"$f":"IF(M198<>\"\", \"\", IF(AND(F198<>\"\", LOWER(F198) <> \"r\"),G198,\"\"))","v":""},{"$f":"IF(K198=\"\", \"\", VLOOKUP(K198,Projekte!C:D,2,FALSE))","v":""}]
[null,null,null,"","",null,"","","","",null,null,null,"","","",{"$f":"IF(K199=\"\", \"\", VLOOKUP(K199,Projekte!C:D,2,FALSE))","v":""}]
[null,null,null,"","",null,"","","","",null,null,null,"","","",{"$f":"IF(K200=\"\", \"\", VLOOKUP(K200,Projekte!C:D,2,FALSE))","v":""}]
[null,null,null,"","",null,"","","","",null,null,null,"","","",{"$f":"IF(K201=\"\", \"\", VLOOKUP(K201,Projekte!C:D,2,FALSE))","v":""}]
[null,null,null,"","",null,"","","","",null,null,null,"","","",{"$f":"IF(K202=\"\", \"\", VLOOKUP(K202,Projekte!C:D,2,FALSE))","v":""}]
[null,null,null,"","",null,{"$f":"IF(K203 = selectThisProjekt,E203, \"\")","v":""},"","","",null,null,null,"","","",{"$f":"IF(K203=\"\", \"\", VLOOKUP(K203,Projekte!C:D,2,FALSE))","v":""}]
[null,null,null,"<Ende Formeln>"]

{"sheet":"Jun","index":6,"n_rows":204,"n_cols":17,"rows_kept":204,"cut":false,"hidden":false,"merged":[[0,13,0,15],[2,0,2,2]]}
[null,null,"DL-Zeiten von",{"$f":"AssignedToCfg","v":{"$error":"#REF!"}},null,null,null,null,null,null,null,null,null,"Faktura nicht erfasst"]
["Datum","Beginn","Ende","h","h,xx","r: Reise, \nx: nicht berechnen","Summe","Dienstleistung","Reise","nicht berechnen",null,"Tätigkeit","Faktura erfasst","Dienstleistung","Reise","nicht berechnen","Projektname"]
[null,null,null,null,null,"Summe",{"$f":"SUM(G4:G203)","v":0},{"$f":"SUM(H4:H203)","v":0},{"$f":"SUM(I4:I203)","v":0},{"$f":"SUM(J4:J203)","v":0},null,"<- für diesen ProjektBereich",null,{"$f":"SUM(N4:N203)","v":0},{"$f":"SUM(O4:O203)","v":0},{"$f":"SUM(P4:P203)","v":0}]
[null,null,null,{"$f":"IF(C4=\"\", \"\", C4-B4)","v":""},{"$f":"IF(D4=\"\", \"\", (C4-B4)*24)","v":""},null,{"$f":"IF(K4 = selectThisProjekt,E4, \"\")","v":""},{"$f":"IF(F4 = \"\", G4, \"\")","v":""},{"$f":"IF(LOWER(F4) = \"r\",G4,\"\")","v":""},{"$f":"IF(AND(F4<>\"\", LOWER(F4) <> \"r\"),G4,\"\")","v":""},null,null,null,{"$f":"IF(M4<>\"\", \"\", IF(F4 = \"\", G4, \"\"))","v":""},{"$f":"IF(M4<>\"\", \"\", IF(LOWER(F4) = \"r\",G4,\"\"))","v":""},{"$f":"IF(M4<>\"\", \"\", IF(AND(F4<>\"\", LOWER(F4) <> \"r\"),G4,\"\"))","v":""},{"$f":"IF(K4=\"\", \"\", VLOOKUP(K4,Projekte!C:D,2,FALSE))","v":""}]
[null,null,null,"","",null,"",{"$f":"IF(F5 = \"\", G5, \"\")","v":""},{"$f":"IF(LOWER(F5) = \"r\",G5,\"\")","v":""},{"$f":"IF(AND(F5<>\"\", LOWER(F5) <> \"r\"),G5,\"\")","v":""},null,null,null,{"$f":"IF(M5<>\"\", \"\", IF(F5 = \"\", G5, \"\"))","v":""},{"$f":"IF(M5<>\"\", \"\", IF(LOWER(F5) = \"r\",G5,\"\"))","v":""},{"$f":"IF(M5<>\"\", \"\", IF(AND(F5<>\"\", LOWER(F5) <> \"r\"),G5,\"\"))","v":""},{"$f":"IF(K5=\"\", \"\", VLOOKUP(K5,Projekte!C:D,2,FALSE))","v":""}]
[null,null,null,"","",null,"","","","",null,null,null,{"$f":"IF(M6<>\"\", \"\", IF(F6 = \"\", G6, \"\"))","v":""},{"$f":"IF(M6<>\"\", \"\", IF(LOWER(F6) = \"r\",G6,\"\"))","v":""},{"$f":"IF(M6<>\"\", \"\", IF(AND(F6<>\"\", LOWER(F6) <> \"r\"),G6,\"\"))","v":""},{"$f":"IF(K6=\"\", \"\", VLOOKUP(K6,Projekte!C:D,2,FALSE))","v":""}]
[null,null,null,"","",null,"","","","",null,null,null,"","","",{"$f":"IF(K7=\"\", \"\", VLOOKUP(K7,Projekte!C:D,2,FALSE))","v":""}]
[null,null,null,"","",null,"","","","",null,null,null,"","","",{"$f":"IF(K8=\"\", \"\", VLOOKUP(K8,Projekte!C:D,2,FALSE))","v":""}]
[null,null,null,"","",null,"","","","",null,null,null,"","","",{"$f":"IF(K9=\"\", \"\", VLOOKUP(K9,Projekte!C:D,2,FALSE))","v":""}]
[null,null,null,"","",null,"","","","",null,null,null,"","","",{"$f":"IF(K10=\"\", \"\", VLOOKUP(K10,Projekte!C:D,2,FALSE))","v":""}]
[null,null,null,"","",null,"","","","",null,null,null,"","","",{"$f":"IF(K11=\"\", \"\", VLOOKUP(K11,Projekte!C:D,2,FALSE))","v":""}]
[null,null,null,"","",null,"","","","",null,null,null,"","","",{"$f":"IF(K12=\"\", \"\", VLOOKUP(K12,Projekte!C:D,2,FALSE))","v":""}]
[null,null,null,"","",null,"","","","",null,null,null,"","","",{"$f":"IF(K13=\"\", \"\", VLOOKUP(K13,Projekte!C:D,2,FALSE))","v":""}]
[null,null,null,"","",null,"","","","",null,null,null,"","","",{"$f":"IF(K14=\"\", \"\", VLOOKUP(K14,Projekte!C:D,2,FALSE))","v":""}]
[null,null,null,"","",null,"","","","",null,null,null,"","","",{"$f":"IF(K15=\"\", \"\", VLOOKUP(K15,Projekte!C:D,2,FALSE))","v":""}]
[null,null,null,"","",null,"","","","",null,null,null,"","","",{"$f":"IF(K16=\"\", \"\", VLOOKUP(K16,Projekte!C:D,2,FALSE))","v":""}]
[null,null,null,"","",null,"","","","",null,null,null,"","","",{"$f":"IF(K17=\"\", \"\", VLOOKUP(K17,Projekte!C:D,2,FALSE))","v":""}]
[null,null,null,"","",null,"","","","",null,null,null,"","","",{"$f":"IF(K18=\"\", \"\", VLOOKUP(K18,Projekte!C:D,2,FALSE))","v":""}]
[null,null,null,"","",null,"","","","",null,null,null,"","","",{"$f":"IF(K19=\"\", \"\", VLOOKUP(K19,Projekte!C:D,2,FALSE))","v":""}]
[null,null,null,"","",null,"","","","",null,null,null,"","","",{"$f":"IF(K20=\"\", \"\", VLOOKUP(K20,Projekte!C:D,2,FALSE))","v":""}]
[null,null,null,"","",null,"","","","",null,null,null,"","","",{"$f":"IF(K21=\"\", \"\", VLOOKUP(K21,Projekte!C:D,2,FALSE))","v":""}]
[null,null,null,"","",null,"","","","",null,null,null,"","","",{"$f":"IF(K22=\"\", \"\", VLOOKUP(K22,Projekte!C:D,2,FALSE))","v":""}]
[null,null,null,"","",null,"","","","",null,null,null,"","","",{"$f":"IF(K23=\"\", \"\", VLOOKUP(K23,Projekte!C:D,2,FALSE))","v":""}]
[null,null,null,"","",null,"","","","",null,null,null,"","","",{"$f":"IF(K24=\"\", \"\", VLOOKUP(K24,Projekte!C:D,2,FALSE))","v":""}]
[null,null,null,"","",null,"","","","",null,null,null,"","","",{"$f":"IF(K25=\"\", \"\", VLOOKUP(K25,Projekte!C:D,2,FALSE))","v":""}]
[null,null,null,"","",null,"","","","",null,null,null,"","","",{"$f":"IF(K26=\"\", \"\", VLOOKUP(K26,Projekte!C:D,2,FALSE))","v":""}]
[null,null,null,"","",null,"","","","",null,null,null,"","","",{"$f":"IF(K27=\"\", \"\", VLOOKUP(K27,Projekte!C:D,2,FALSE))","v":""}]
[null,null,null,"","",null,"","","","",null,null,null,"","","",{"$f":"IF(K28=\"\", \"\", VLOOKUP(K28,Projekte!C:D,2,FALSE))","v":""}]
[null,null,null,"","",null,"","","","",null,null,null,"","","",{"$f":"IF(K29=\"\", \"\", VLOOKUP(K29,Projekte!C:D,2,FALSE))","v":""}]
[null,null,null,"","",null,"","","","",null,null,null,"","","",{"$f":"IF(K30=\"\", \"\", VLOOKUP(K30,Projekte!C:D,2,FALSE))","v":""}]
[null,null,null,"","",null,"","","","",null,null,null,"","","",{"$f":"IF(K31=\"\", \"\", VLOOKUP(K31,Projekte!C:D,2,FALSE))","v":""}]
[null,null,null,"","",null,"","","","",null,null,null,"","","",{"$f":"IF(K32=\"\", \"\", VLOOKUP(K32,Projekte!C:D,2,FALSE))","v":""}]
[null,null,null,"","",null,"","","","",null,null,null,"","","",{"$f":"IF(K33=\"\", \"\", VLOOKUP(K33,Projekte!C:D,2,FALSE))","v":""}]
[null,null,null,"","",null,"","","","",null,null,null,"","","",{"$f":"IF(K34=\"\", \"\", VLOOKUP(K34,Projekte!C:D,2,FALSE))","v":""}]
[null,null,null,"","",null,"","","","",null,null,null,"","","",{"$f":"IF(K35=\"\", \"\", VLOOKUP(K35,Projekte!C:D,2,FALSE))","v":""}]
[null,null,null,"","",null,{"$f":"IF(K36 = selectThisProjekt,E36, \"\")","v":""},"","","",null,null,null,"","","",{"$f":"IF(K36=\"\", \"\", VLOOKUP(K36,Projekte!C:D,2,FALSE))","v":""}]
[null,null,null,"","",null,"","","","",null,null,null,"","","",{"$f":"IF(K37=\"\", \"\", VLOOKUP(K37,Projekte!C:D,2,FALSE))","v":""}]
[null,null,null,"","",null,"","","","",null,null,null,"","","",{"$f":"IF(K38=\"\", \"\", VLOOKUP(K38,Projekte!C:D,2,FALSE))","v":""}]
[null,null,null,"","",null,"","","","",null,null,null,"","","",{"$f":"IF(K39=\"\", \"\", VLOOKUP(K39,Projekte!C:D,2,FALSE))","v":""}]
[null,null,null,"","",null,"","","","",null,null,null,"","","",{"$f":"IF(K40=\"\", \"\", VLOOKUP(K40,Projekte!C:D,2,FALSE))","v":""}]
[null,null,null,"","",null,"","","","",null,null,null,"","","",{"$f":"IF(K41=\"\", \"\", VLOOKUP(K41,Projekte!C:D,2,FALSE))","v":""}]
[null,null,null,"","",null,"","","","",null,null,null,"","","",{"$f":"IF(K42=\"\", \"\", VLOOKUP(K42,Projekte!C:D,2,FALSE))","v":""}]
[null,null,null,"","",null,"","","","",null,null,null,"","","",{"$f":"IF(K43=\"\", \"\", VLOOKUP(K43,Projekte!C:D,2,FALSE))","v":""}]
[null,null,null,"","",null,"","","","",null,null,null,"","","",{"$f":"IF(K44=\"\", \"\", VLOOKUP(K44,Projekte!C:D,2,FALSE))","v":""}]
[null,null,null,"","",null,"","","","",null,null,null,"","","",{"$f":"IF(K45=\"\", \"\", VLOOKUP(K45,Projekte!C:D,2,FALSE))","v":""}]
[null,null,null,"","",null,"","","","",null,null,null,"","","",{"$f":"IF(K46=\"\", \"\", VLOOKUP(K46,Projekte!C:D,2,FALSE))","v":""}]
[null,null,null,"","",null,"","","","",null,null,null,"","","",{"$f":"IF(K47=\"\", \"\", VLOOKUP(K47,Projekte!C:D,2,FALSE))","v":""}]
[null,null,null,"","",null,"","","","",null,null,null,"","","",{"$f":"IF(K48=\"\", \"\", VLOOKUP(K48,Projekte!C:D,2,FALSE))","v":""}]
[null,null,null,"","",null,"","","","",null,null,null,"","","",{"$f":"IF(K49=\"\", \"\", VLOOKUP(K49,Projekte!C:D,2,FALSE))","v":""}]
[null,null,null,"","",null,"","","","",null,null,null,"","","",{"$f":"IF(K50=\"\", \"\", VLOOKUP(K50,Projekte!C:D,2,FALSE))","v":""}]
[null,null,null,"","",null,"","","","",null,null,null,"","","",{"$f":"IF(K51=\"\", \"\", VLOOKUP(K51,Projekte!C:D,2,FALSE))","v":""}]
[null,null,null,"","",null,"","","","",null,null,null,"","","",{"$f":"IF(K52=\"\", \"\", VLOOKUP(K52,Projekte!C:D,2,FALSE))","v":""}]
[null,null,null,"","",null,"","","","",null,null,null,"","","",{"$f":"IF(K53=\"\", \"\", VLOOKUP(K53,Projekte!C:D,2,FALSE))","v":""}]
[null,null,null,"","",null,"","","","",null,null,null,"","","",{"$f":"IF(K54=\"\", \"\", VLOOKUP(K54,Projekte!C:D,2,FALSE))","v":""}]
[null,null,null,"","",null,"","","","",null,null,null,"","","",{"$f":"IF(K55=\"\", \"\", VLOOKUP(K55,Projekte!C:D,2,FALSE))","v":""}]
[null,null,null,"","",null,"","","","",null,null,null,"","","",{"$f":"IF(K56=\"\", \"\", VLOOKUP(K56,Projekte!C:D,2,FALSE))","v":""}]
[null,null,null,"","",null,"","","","",null,null,null,"","","",{"$f":"IF(K57=\"\", \"\", VLOOKUP(K57,Projekte!C:D,2,FALSE))","v":""}]
[null,null,null,"","",null,"","","","",null,null,null,"","","",{"$f":"IF(K58=\"\", \"\", VLOOKUP(K58,Projekte!C:D,2,FALSE))","v":""}]
[null,null,null,"","",null,"","","","",null,null,null,"","","",{"$f":"IF(K59=\"\", \"\", VLOOKUP(K59,Projekte!C:D,2,FALSE))","v":""}]
[null,null,null,"","",null,"","","","",null,null,null,"","","",{"$f":"IF(K60=\"\", \"\", VLOOKUP(K60,Projekte!C:D,2,FALSE))","v":""}]
[null,null,null,"","",null,"","","","",null,null,null,"","","",{"$f":"IF(K61=\"\", \"\", VLOOKUP(K61,Projekte!C:D,2,FALSE))","v":""}]
[null,null,null,"","",null,"","","","",null,null,null,"","","",{"$f":"IF(K62=\"\", \"\", VLOOKUP(K62,Projekte!C:D,2,FALSE))","v":""}]
[null,null,null,"","",null,"","","","",null,null,null,"","","",{"$f":"IF(K63=\"\", \"\", VLOOKUP(K63,Projekte!C:D,2,FALSE))","v":""}]
[null,null,null,"","",null,"","","","",null,null,null,"","","",{"$f":"IF(K64=\"\", \"\", VLOOKUP(K64,Projekte!C:D,2,FALSE))","v":""}]
[null,null,null,"","",null,"","","","",null,null,null,"","","",{"$f":"IF(K65=\"\", \"\", VLOOKUP(K65,Projekte!C:D,2,FALSE))","v":""}]
[null,null,null,"","",null,"","","","",null,null,null,"","","",{"$f":"IF(K66=\"\", \"\", VLOOKUP(K66,Projekte!C:D,2,FALSE))","v":""}]
[null,null,null,"","",null,"","","","",null,null,null,"","","",{"$f":"IF(K67=\"\", \"\", VLOOKUP(K67,Projekte!C:D,2,FALSE))","v":""}]
[null,null,null,{"$f":"IF(C68=\"\", \"\", C68-B68)","v":""},{"$f":"IF(D68=\"\", \"\", (C68-B68)*24)","v":""},null,{"$f":"IF(K68 = selectThisProjekt,E68, \"\")","v":""},"","","",null,null,null,"","","",{"$f":"IF(K68=\"\", \"\", VLOOKUP(K68,Projekte!C:D,2,FALSE))","v":""}]
[null,null,null,"","",null,"",{"$f":"IF(F69 = \"\", G69, \"\")","v":""},{"$f":"IF(LOWER(F69) = \"r\",G69,\"\")","v":""},{"$f":"IF(AND(F69<>\"\", LOWER(F69) <> \"r\"),G69,\"\")","v":""},null,null,null,"","","",{"$f":"IF(K69=\"\", \"\", VLOOKUP(K69,Projekte!C:D,2,FALSE))","v":""}]
[null,null,null,"","",null,"","","","",null,null,null,{"$f":"IF(M70<>\"\", \"\", IF(F70 = \"\", G70, \"\"))","v":""},{"$f":"IF(M70<>\"\", \"\", IF(LOWER(F70) = \"r\",G70,\"\"))","v":""},{"$f":"IF(M70<>\"\", \"\", IF(AND(F70<>\"\", LOWER(F70) <> \"r\"),G70,\"\"))","v":""},{"$f":"IF(K70=\"\", \"\", VLOOKUP(K70,Projekte!C:D,2,FALSE))","v":""}]
[null,null,null,"","",null,"","","","",null,null,null,"","","",{"$f":"IF(K71=\"\", \"\", VLOOKUP(K71,Projekte!C:D,2,FALSE))","v":""}]
[null,null,null,"","",null,"","","","",null,null,null,"","","",{"$f":"IF(K72=\"\", \"\", VLOOKUP(K72,Projekte!C:D,2,FALSE))","v":""}]
[null,null,null,"","",null,"","","","",null,null,null,"","","",{"$f":"IF(K73=\"\", \"\", VLOOKUP(K73,Projekte!C:D,2,FALSE))","v":""}]
[null,null,null,"","",null,"","","","",null,null,null,"","","",{"$f":"IF(K74=\"\", \"\", VLOOKUP(K74,Projekte!C:D,2,FALSE))","v":""}]
[null,null,null,"","",null,"","","","",null,null,null,"","","",{"$f":"IF(K75=\"\", \"\", VLOOKUP(K75,Projekte!C:D,2,FALSE))","v":""}]
[null,null,null,"","",null,"","","","",null,null,null,"","","",{"$f":"IF(K76=\"\", \"\", VLOOKUP(K76,Projekte!C:D,2,FALSE))","v":""}]
[null,null,null,"","",null,"","","","",null,null,null,"","","",{"$f":"IF(K77=\"\", \"\", VLOOKUP(K77,Projekte!C:D,2,FALSE))","v":""}]
[null,null,null,"","",null,"","","","",null,null,null,"","","",{"$f":"IF(K78=\"\", \"\", VLOOKUP(K78,Projekte!C:D,2,FALSE))","v":""}]
[null,null,null,"","",null,"","","","",null,null,null,"","","",{"$f":"IF(K79=\"\", \"\", VLOOKUP(K79,Projekte!C:D,2,FALSE))","v":""}]
[null,null,null,"","",null,"","","","",null,null,null,"","","",{"$f":"IF(K80=\"\", \"\", VLOOKUP(K80,Projekte!C:D,2,FALSE))","v":""}]
[null,null,null,"","",null,"","","","",null,null,null,"","","",{"$f":"IF(K81=\"\", \"\", VLOOKUP(K81,Projekte!C:D,2,FALSE))","v":""}]
[null,null,null,"","",null,"","","","",null,null,null,"","","",{"$f":"IF(K82=\"\", \"\", VLOOKUP(K82,Projekte!C:D,2,FALSE))","v":""}]
[null,null,null,"","",null,"","","","",null,null,null,"","","",{"$f":"IF(K83=\"\", \"\", VLOOKUP(K83,Projekte!C:D,2,FALSE))","v":""}]
[null,null,null,"","",null,"","","","",null,null,null,"","","",{"$f":"IF(K84=\"\", \"\", VLOOKUP(K84,Projekte!C:D,2,FALSE))","v":""}]
[null,null,null,"","",null,"","","","",null,null,null,"","","",{"$f":"IF(K85=\"\", \"\", VLOOKUP(K85,Projekte!C:D,2,FALSE))","v":""}]
[null,null,null,"","",null,"","","","",null,null,null,"","","",{"$f":"IF(K86=\"\", \"\", VLOOKUP(K86,Projekte!C:D,2,FALSE))","v":""}]
[null,null,null,"","",null,"","","","",null,null,null,"","","",{"$f":"IF(K87=\"\", \"\", VLOOKUP(K87,Projekte!C:D,2,FALSE))","v":""}]
[null,null,null,"","",null,"","","","",null,null,null,"","","",{"$f":"IF(K88=\"\", \"\", VLOOKUP(K88,Projekte!C:D,2,FALSE))","v":""}]
[null,null,null,"","",null,"","","","",null,null,null,"","","",{"$f":"IF(K89=\"\", \"\", VLOOKUP(K89,Projekte!C:D,2,FALSE))","v":""}]
[null,null,null,"","",null,"","","","",null,null,null,"","","",{"$f":"IF(K90=\"\", \"\", VLOOKUP(K90,Projekte!C:D,2,FALSE))","v":""}]
[null,null,null,"","",null,"","","","",null,null,null,"","","",{"$f":"IF(K91=\"\", \"\", VLOOKUP(K91,Projekte!C:D,2,FALSE))","v":""}]
[null,null,null,"","",null,"","","","",null,null,null,"","","",{"$f":"IF(K92=\"\", \"\", VLOOKUP(K92,Projekte!C:D,2,FALSE))","v":""}]
[null,null,null,"","",null,"","","","",null,null,null,"","","",{"$f":"IF(K93=\"\", \"\", VLOOKUP(K93,Projekte!C:D,2,FALSE))","v":""}]
[null,null,null,"","",null,"","","","",null,null,null,"","","",{"$f":"IF(K94=\"\", \"\", VLOOKUP(K94,Projekte!C:D,2,FALSE))","v":""}]
[null,null,null,"","",null,"","","","",null,null,null,"","","",{"$f":"IF(K95=\"\", \"\", VLOOKUP(K95,Projekte!C:D,2,FALSE))","v":""}]
[null,null,null,"","",null,"","","","",null,null,null,"","","",{"$f":"IF(K96=\"\", \"\", VLOOKUP(K96,Projekte!C:D,2,FALSE))","v":""}]
[null,null,null,"","",null,"","","","",null,null,null,"","","",{"$f":"IF(K97=\"\", \"\", VLOOKUP(K97,Projekte!C:D,2,FALSE))","v":""}]
[null,null,null,"","",null,"","","","",null,null,null,"","","",{"$f":"IF(K98=\"\", \"\", VLOOKUP(K98,Projekte!C:D,2,FALSE))","v":""}]
[null,null,null,"","",null,"","","","",null,null,null,"","","",{"$f":"IF(K99=\"\", \"\", VLOOKUP(K99,Projekte!C:D,2,FALSE))","v":""}]
[null,null,null,"","",null,{"$f":"IF(K100 = selectThisProjekt,E100, \"\")","v":""},"","","",null,null,null,"","","",{"$f":"IF(K100=\"\", \"\", VLOOKUP(K100,Projekte!C:D,2,FALSE))","v":""}]
[null,null,null,"","",null,"","","","",null,null,null,"","","",{"$f":"IF(K101=\"\", \"\", VLOOKUP(K101,Projekte!C:D,2,FALSE))","v":""}]
[null,null,null,"","",null,"","","","",null,null,null,"","","",{"$f":"IF(K102=\"\", \"\", VLOOKUP(K102,Projekte!C:D,2,FALSE))","v":""}]
[null,null,null,"","",null,"","","","",null,null,null,"","","",{"$f":"IF(K103=\"\", \"\", VLOOKUP(K103,Projekte!C:D,2,FALSE))","v":""}]
[null,null,null,"","",null,"","","","",null,null,null,"","","",{"$f":"IF(K104=\"\", \"\", VLOOKUP(K104,Projekte!C:D,2,FALSE))","v":""}]
[null,null,null,"","",null,"","","","",null,null,null,"","","",{"$f":"IF(K105=\"\", \"\", VLOOKUP(K105,Projekte!C:D,2,FALSE))","v":""}]
[null,null,null,"","",null,"","","","",null,null,null,"","","",{"$f":"IF(K106=\"\", \"\", VLOOKUP(K106,Projekte!C:D,2,FALSE))","v":""}]
[null,null,null,"","",null,"","","","",null,null,null,"","","",{"$f":"IF(K107=\"\", \"\", VLOOKUP(K107,Projekte!C:D,2,FALSE))","v":""}]
[null,null,null,"","",null,"","","","",null,null,null,"","","",{"$f":"IF(K108=\"\", \"\", VLOOKUP(K108,Projekte!C:D,2,FALSE))","v":""}]
[null,null,null,"","",null,"","","","",null,null,null,"","","",{"$f":"IF(K109=\"\", \"\", VLOOKUP(K109,Projekte!C:D,2,FALSE))","v":""}]
[null,null,null,"","",null,"","","","",null,null,null,"","","",{"$f":"IF(K110=\"\", \"\", VLOOKUP(K110,Projekte!C:D,2,FALSE))","v":""}]
[null,null,null,"","",null,"","","","",null,null,null,"","","",{"$f":"IF(K111=\"\", \"\", VLOOKUP(K111,Projekte!C:D,2,FALSE))","v":""}]
[null,null,null,"","",null,"","","","",null,null,null,"","","",{"$f":"IF(K112=\"\", \"\", VLOOKUP(K112,Projekte!C:D,2,FALSE))","v":""}]
[null,null,null,"","",null,"","","","",null,null,null,"","","",{"$f":"IF(K113=\"\", \"\", VLOOKUP(K113,Projekte!C:D,2,FALSE))","v":""}]
[null,null,null,"","",null,"","","","",null,null,null,"","","",{"$f":"IF(K114=\"\", \"\", VLOOKUP(K114,Projekte!C:D,2,FALSE))","v":""}]
[null,null,null,"","",null,"","","","",null,null,null,"","","",{"$f":"IF(K115=\"\", \"\", VLOOKUP(K115,Projekte!C:D,2,FALSE))","v":""}]
[null,null,null,"","",null,"","","","",null,null,null,"","","",{"$f":"IF(K116=\"\", \"\", VLOOKUP(K116,Projekte!C:D,2,FALSE))","v":""}]
[null,null,null,"","",null,"","","","",null,null,null,"","","",{"$f":"IF(K117=\"\", \"\", VLOOKUP(K117,Projekte!C:D,2,FALSE))","v":""}]
[null,null,null,"","",null,"","","","",null,null,null,"","","",{"$f":"IF(K118=\"\", \"\", VLOOKUP(K118,Projekte!C:D,2,FALSE))","v":""}]
[null,null,null,"","",null,"","","","",null,null,null,"","","",{"$f":"IF(K119=\"\", \"\", VLOOKUP(K119,Projekte!C:D,2,FALSE))","v":""}]
[null,null,null,"","",null,"","","","",null,null,null,"","","",{"$f":"IF(K120=\"\", \"\", VLOOKUP(K120,Projekte!C:D,2,FALSE))","v":""}]
[null,null,null,"","",null,"","","","",null,null,null,"","","",{"$f":"IF(K121=\"\", \"\", VLOOKUP(K121,Projekte!C:D,2,FALSE))","v":""}]
[null,null,null,"","",null,"","","","",null,null,null,"","","",{"$f":"IF(K122=\"\", \"\", VLOOKUP(K122,Projekte!C:D,2,FALSE))","v":""}]
[null,null,null,"","",null,{"$f":"IF(K123 = selectThisProjekt,E123, \"\")","v":""},"","","",null,null,null,"","","",{"$f":"IF(K123=\"\", \"\", VLOOKUP(K123,Projekte!C:D,2,FALSE))","v":""}]
[null,null,null,"","",null,"","","","",null,null,null,"","","",{"$f":"IF(K124=\"\", \"\", VLOOKUP(K124,Projekte!C:D,2,FALSE))","v":""}]
[null,null,null,"","",null,{"$f":"IF(K125 = selectThisProjekt,E125, \"\")","v":""},"","","",null,null,null,"","","",{"$f":"IF(K125=\"\", \"\", VLOOKUP(K125,Projekte!C:D,2,FALSE))","v":""}]
[null,null,null,"","",null,"","","","",null,null,null,"","","",{"$f":"IF(K126=\"\", \"\", VLOOKUP(K126,Projekte!C:D,2,FALSE))","v":""}]
[null,null,null,"","",null,"","","","",null,null,null,"","","",{"$f":"IF(K127=\"\", \"\", VLOOKUP(K127,Projekte!C:D,2,FALSE))","v":""}]
[null,null,null,"","",null,"","","","",null,null,null,"","","",{"$f":"IF(K128=\"\", \"\", VLOOKUP(K128,Projekte!C:D,2,FALSE))","v":""}]
[null,null,null,"","",null,"","","","",null,null,null,"","","",{"$f":"IF(K129=\"\", \"\", VLOOKUP(K129,Projekte!C:D,2,FALSE))","v":""}]
[null,null,null,"","",null,"","","","",null,null,null,"","","",{"$f":"IF(K130=\"\", \"\", VLOOKUP(K130,Projekte!C:D,2,FALSE))","v":""}]
[null,null,null,"","",null,"","","","",null,null,null,"","","",{"$f":"IF(K131=\"\", \"\", VLOOKUP(K131,Projekte!C:D,2,FALSE))","v":""}]
[null,null,null,{"$f":"IF(C132=\"\", \"\", C132-B132)","v":""},{"$f":"IF(D132=\"\", \"\", (C132-B132)*24)","v":""},null,{"$f":"IF(K132 = selectThisProjekt,E132, \"\")","v":""},"","","",null,null,null,"","","",{"$f":"IF(K132=\"\", \"\", VLOOKUP(K132,Projekte!C:D,2,FALSE))","v":""}]
[null,null,null,"","",null,"",{"$f":"IF(F133 = \"\", G133, \"\")","v":""},{"$f":"IF(LOWER(F133) = \"r\",G133,\"\")","v":""},{"$f":"IF(AND(F133<>\"\", LOWER(F133) <> \"r\"),G133,\"\")","v":""},null,null,null,"","","",{"$f":"IF(K133=\"\", \"\", VLOOKUP(K133,Projekte!C:D,2,FALSE))","v":""}]
[null,null,null,"","",null,"","","","",null,null,null,{"$f":"IF(M134<>\"\", \"\", IF(F134 = \"\", G134, \"\"))","v":""},{"$f":"IF(M134<>\"\", \"\", IF(LOWER(F134) = \"r\",G134,\"\"))","v":""},{"$f":"IF(M134<>\"\", \"\", IF(AND(F134<>\"\", LOWER(F134) <> \"r\"),G134,\"\"))","v":""},{"$f":"IF(K134=\"\", \"\", VLOOKUP(K134,Projekte!C:D,2,FALSE))","v":""}]
[null,null,null,"","",null,"","","","",null,null,null,"","","",{"$f":"IF(K135=\"\", \"\", VLOOKUP(K135,Projekte!C:D,2,FALSE))","v":""}]
[null,null,null,"","",null,"","","","",null,null,null,"","","",{"$f":"IF(K136=\"\", \"\", VLOOKUP(K136,Projekte!C:D,2,FALSE))","v":""}]
[null,null,null,"","",null,"","","","",null,null,null,"","","",{"$f":"IF(K137=\"\", \"\", VLOOKUP(K137,Projekte!C:D,2,FALSE))","v":""}]
[null,null,null,"","",null,"","","","",null,null,null,"","","",{"$f":"IF(K138=\"\", \"\", VLOOKUP(K138,Projekte!C:D,2,FALSE))","v":""}]
[null,null,null,"","",null,"","","","",null,null,null,"","","",{"$f":"IF(K139=\"\", \"\", VLOOKUP(K139,Projekte!C:D,2,FALSE))","v":""}]
[null,null,null,"","",null,"","","","",null,null,null,"","","",{"$f":"IF(K140=\"\", \"\", VLOOKUP(K140,Projekte!C:D,2,FALSE))","v":""}]
[null,null,null,"","",null,"","","","",null,null,null,"","","",{"$f":"IF(K141=\"\", \"\", VLOOKUP(K141,Projekte!C:D,2,FALSE))","v":""}]
[null,null,null,"","",null,"","","","",null,null,null,"","","",{"$f":"IF(K142=\"\", \"\", VLOOKUP(K142,Projekte!C:D,2,FALSE))","v":""}]
[null,null,null,"","",null,"","","","",null,null,null,"","","",{"$f":"IF(K143=\"\", \"\", VLOOKUP(K143,Projekte!C:D,2,FALSE))","v":""}]
[null,null,null,"","",null,"","","","",null,null,null,"","","",{"$f":"IF(K144=\"\", \"\", VLOOKUP(K144,Projekte!C:D,2,FALSE))","v":""}]
[null,null,null,"","",null,"","","","",null,null,null,"","","",{"$f":"IF(K145=\"\", \"\", VLOOKUP(K145,Projekte!C:D,2,FALSE))","v":""}]
[null,null,null,"","",null,"","","","",null,null,null,"","","",{"$f":"IF(K146=\"\", \"\", VLOOKUP(K146,Projekte!C:D,2,FALSE))","v":""}]
[null,null,null,"","",null,"","","","",null,null,null,"","","",{"$f":"IF(K147=\"\", \"\", VLOOKUP(K147,Projekte!C:D,2,FALSE))","v":""}]
[null,null,null,"","",null,"","","","",null,null,null,"","","",{"$f":"IF(K148=\"\", \"\", VLOOKUP(K148,Projekte!C:D,2,FALSE))","v":""}]
[null,null,null,"","",null,"","","","",null,null,null,"","","",{"$f":"IF(K149=\"\", \"\", VLOOKUP(K149,Projekte!C:D,2,FALSE))","v":""}]
[null,null,null,"","",null,"","","","",null,null,null,"","","",{"$f":"IF(K150=\"\", \"\", VLOOKUP(K150,Projekte!C:D,2,FALSE))","v":""}]
[null,null,null,"","",null,"","","","",null,null,null,"","","",{"$f":"IF(K151=\"\", \"\", VLOOKUP(K151,Projekte!C:D,2,FALSE))","v":""}]
[null,null,null,"","",null,"","","","",null,null,null,"","","",{"$f":"IF(K152=\"\", \"\", VLOOKUP(K152,Projekte!C:D,2,FALSE))","v":""}]
[null,null,null,"","",null,"","","","",null,null,null,"","","",{"$f":"IF(K153=\"\", \"\", VLOOKUP(K153,Projekte!C:D,2,FALSE))","v":""}]
[null,null,null,"","",null,"","","","",null,null,null,"","","",{"$f":"IF(K154=\"\", \"\", VLOOKUP(K154,Projekte!C:D,2,FALSE))","v":""}]
[null,null,null,"","",null,"","","","",null,null,null,"","","",{"$f":"IF(K155=\"\", \"\", VLOOKUP(K155,Projekte!C:D,2,FALSE))","v":""}]
[null,null,null,"","",null,"","","","",null,null,null,"","","",{"$f":"IF(K156=\"\", \"\", VLOOKUP(K156,Projekte!C:D,2,FALSE))","v":""}]
[null,null,null,"","",null,"","","","",null,null,null,"","","",{"$f":"IF(K157=\"\", \"\", VLOOKUP(K157,Projekte!C:D,2,FALSE))","v":""}]
[null,null,null,"","",null,"","","","",null,null,null,"","","",{"$f":"IF(K158=\"\", \"\", VLOOKUP(K158,Projekte!C:D,2,FALSE))","v":""}]
[null,null,null,"","",null,"","","","",null,null,null,"","","",{"$f":"IF(K159=\"\", \"\", VLOOKUP(K159,Projekte!C:D,2,FALSE))","v":""}]
[null,null,null,"","",null,"","","","",null,null,null,"","","",{"$f":"IF(K160=\"\", \"\", VLOOKUP(K160,Projekte!C:D,2,FALSE))","v":""}]
[null,null,null,"","",null,"","","","",null,null,null,"","","",{"$f":"IF(K161=\"\", \"\", VLOOKUP(K161,Projekte!C:D,2,FALSE))","v":""}]
[null,null,null,"","",null,"","","","",null,null,null,"","","",{"$f":"IF(K162=\"\", \"\", VLOOKUP(K162,Projekte!C:D,2,FALSE))","v":""}]
[null,null,null,"","",null,"","","","",null,null,null,"","","",{"$f":"IF(K163=\"\", \"\", VLOOKUP(K163,Projekte!C:D,2,FALSE))","v":""}]
[null,null,null,"","",null,{"$f":"IF(K164 = selectThisProjekt,E164, \"\")","v":""},"","","",null,null,null,"","","",{"$f":"IF(K164=\"\", \"\", VLOOKUP(K164,Projekte!C:D,2,FALSE))","v":""}]
[null,null,null,"","",null,"","","","",null,null,null,"","","",{"$f":"IF(K165=\"\", \"\", VLOOKUP(K165,Projekte!C:D,2,FALSE))","v":""}]
[null,null,null,"","",null,"","","","",null,null,null,"","","",{"$f":"IF(K166=\"\", \"\", VLOOKUP(K166,Projekte!C:D,2,FALSE))","v":""}]
[null,null,null,"","",null,"","","","",null,null,null,"","","",{"$f":"IF(K167=\"\", \"\", VLOOKUP(K167,Projekte!C:D,2,FALSE))","v":""}]
[null,null,null,"","",null,"","","","",null,null,null,"","","",{"$f":"IF(K168=\"\", \"\", VLOOKUP(K168,Projekte!C:D,2,FALSE))","v":""}]
[null,null,null,"","",null,"","","","",null,null,null,"","","",{"$f":"IF(K169=\"\", \"\", VLOOKUP(K169,Projekte!C:D,2,FALSE))","v":""}]
[null,null,null,"","",null,{"$f":"IF(K170 = selectThisProjekt,E170, \"\")","v":""},"","","",null,null,null,"","","",{"$f":"IF(K170=\"\", \"\", VLOOKUP(K170,Projekte!C:D,2,FALSE))","v":""}]
[null,null,null,"","",null,"","","","",null,null,null,"","","",{"$f":"IF(K171=\"\", \"\", VLOOKUP(K171,Projekte!C:D,2,FALSE))","v":""}]
[null,null,null,"","",null,"","","","",null,null,null,"","","",{"$f":"IF(K172=\"\", \"\", VLOOKUP(K172,Projekte!C:D,2,FALSE))","v":""}]
[null,null,null,"","",null,"","","","",null,null,null,"","","",{"$f":"IF(K173=\"\", \"\", VLOOKUP(K173,Projekte!C:D,2,FALSE))","v":""}]
[null,null,null,"","",null,"","","","",null,null,null,"","","",{"$f":"IF(K174=\"\", \"\", VLOOKUP(K174,Projekte!C:D,2,FALSE))","v":""}]
[null,null,null,"","",null,"","","","",null,null,null,"","","",{"$f":"IF(K175=\"\", \"\", VLOOKUP(K175,Projekte!C:D,2,FALSE))","v":""}]
[null,null,null,"","",null,"","","","",null,null,null,"","","",{"$f":"IF(K176=\"\", \"\", VLOOKUP(K176,Projekte!C:D,2,FALSE))","v":""}]
[null,null,null,"","",null,"","","","",null,null,null,"","","",{"$f":"IF(K177=\"\", \"\", VLOOKUP(K177,Projekte!C:D,2,FALSE))","v":""}]
[null,null,null,"","",null,"","","","",null,null,null,"","","",{"$f":"IF(K178=\"\", \"\", VLOOKUP(K178,Projekte!C:D,2,FALSE))","v":""}]
[null,null,null,"","",null,"","","","",null,null,null,"","","",{"$f":"IF(K179=\"\", \"\", VLOOKUP(K179,Projekte!C:D,2,FALSE))","v":""}]
[null,null,null,"","",null,"","","","",null,null,null,"","","",{"$f":"IF(K180=\"\", \"\", VLOOKUP(K180,Projekte!C:D,2,FALSE))","v":""}]
[null,null,null,"","",null,"","","","",null,null,null,"","","",{"$f":"IF(K181=\"\", \"\", VLOOKUP(K181,Projekte!C:D,2,FALSE))","v":""}]
[null,null,null,"","",null,"","","","",null,null,null,"","","",{"$f":"IF(K182=\"\", \"\", VLOOKUP(K182,Projekte!C:D,2,FALSE))","v":""}]
[null,null,null,"","",null,"","","","",null,null,null,"","","",{"$f":"IF(K183=\"\", \"\", VLOOKUP(K183,Projekte!C:D,2,FALSE))","v":""}]
[null,null,null,"","",null,"","","","",null,null,null,"","","",{"$f":"IF(K184=\"\", \"\", VLOOKUP(K184,Projekte!C:D,2,FALSE))","v":""}]
[null,null,null,"","",null,"","","","",null,null,null,"","","",{"$f":"IF(K185=\"\", \"\", VLOOKUP(K185,Projekte!C:D,2,FALSE))","v":""}]
[null,null,null,"","",null,"","","","",null,null,null,"","","",{"$f":"IF(K186=\"\", \"\", VLOOKUP(K186,Projekte!C:D,2,FALSE))","v":""}]
[null,null,null,"","",null,"","","","",null,null,null,"","","",{"$f":"IF(K187=\"\", \"\", VLOOKUP(K187,Projekte!C:D,2,FALSE))","v":""}]
[null,null,null,"","",null,"","","","",null,null,null,"","","",{"$f":"IF(K188=\"\", \"\", VLOOKUP(K188,Projekte!C:D,2,FALSE))","v":""}]
[null,null,null,"","",null,"","","","",null,null,null,"","","",{"$f":"IF(K189=\"\", \"\", VLOOKUP(K189,Projekte!C:D,2,FALSE))","v":""}]
[null,null,null,"","",null,"","","","",null,null,null,"","","",{"$f":"IF(K190=\"\", \"\", VLOOKUP(K190,Projekte!C:D,2,FALSE))","v":""}]
[null,null,null,"","",null,"","","","",null,null,null,"","","",{"$f":"IF(K191=\"\", \"\", VLOOKUP(K191,Projekte!C:D,2,FALSE))","v":""}]
[null,null,null,"","",null,"","","","",null,null,null,"","","",{"$f":"IF(K192=\"\", \"\", VLOOKUP(K192,Projekte!C:D,2,FALSE))","v":""}]
[null,null,null,"","",null,"","","","",null,null,null,"","","",{"$f":"IF(K193=\"\", \"\", VLOOKUP(K193,Projekte!C:D,2,FALSE))","v":""}]
[null,null,null,"","",null,"","","","",null,null,null,"","","",{"$f":"IF(K194=\"\", \"\", VLOOKUP(K194,Projekte!C:D,2,FALSE))","v":""}]
[null,null,null,"","",null,"","","","",null,null,null,"","","",{"$f":"IF(K195=\"\", \"\", VLOOKUP(K195,Projekte!C:D,2,FALSE))","v":""}]
[null,null,null,"","",null,"","","","",null,null,null,"","","",{"$f":"IF(K196=\"\", \"\", VLOOKUP(K196,Projekte!C:D,2,FALSE))","v":""}]
[null,null,null,"","",null,"","","","",null,null,null,"","","",{"$f":"IF(K197=\"\", \"\", VLOOKUP(K197,Projekte!C:D,2,FALSE))","v":""}]
[null,null,null,"","",null,"","","","",null,null,null,{"$f":"IF(M198<>\"\", \"\", IF(F198 = \"\", G198, \"\"))","v":""},{"$f":"IF(M198<>\"\", \"\", IF(LOWER(F198) = \"r\",G198,\"\"))","v":""},{"$f":"IF(M198<>\"\", \"\", IF(AND(F198<>\"\", LOWER(F198) <> \"r\"),G198,\"\"))","v":""},{"$f":"IF(K198=\"\", \"\", VLOOKUP(K198,Projekte!C:D,2,FALSE))","v":""}]
[null,null,null,"","",null,"","","","",null,null,null,"","","",{"$f":"IF(K199=\"\", \"\", VLOOKUP(K199,Projekte!C:D,2,FALSE))","v":""}]
[null,null,null,"","",null,"","","","",null,null,null,"","","",{"$f":"IF(K200=\"\", \"\", VLOOKUP(K200,Projekte!C:D,2,FALSE))","v":""}]
[null,null,null,"","",null,"","","","",null,null,null,"","","",{"$f":"IF(K201=\"\", \"\", VLOOKUP(K201,Projekte!C:D,2,FALSE))","v":""}]
[null,null,null,"","",null,"","","","",null,null,null,"","","",{"$f":"IF(K202=\"\", \"\", VLOOKUP(K202,Projekte!C:D,2,FALSE))","v":""}]
[null,null,null,"","",null,{"$f":"IF(K203 = selectThisProjekt,E203, \"\")","v":""},"","","",null,null,null,"","","",{"$f":"IF(K203=\"\", \"\", VLOOKUP(K203,Projekte!C:D,2,FALSE))","v":""}]
[null,null,null,"<Ende Formeln>"]

{"sheet":"Jul","index":7,"n_rows":204,"n_cols":17,"rows_kept":204,"cut":false,"hidden":false,"merged":[[0,13,0,15],[2,0,2,2]]}
[null,null,"DL-Zeiten von",{"$f":"AssignedToCfg","v":{"$error":"#REF!"}},null,null,null,null,null,null,null,null,null,"Faktura nicht erfasst"]
["Datum","Beginn","Ende","h","h,xx","r: Reise, \nx: nicht berechnen","Summe","Dienstleistung","Reise","nicht berechnen",null,"Tätigkeit","Faktura erfasst","Dienstleistung","Reise","nicht berechnen","Projektname"]
[null,null,null,null,null,"Summe",{"$f":"SUM(G4:G203)","v":0},{"$f":"SUM(H4:H203)","v":0},{"$f":"SUM(I4:I203)","v":0},{"$f":"SUM(J4:J203)","v":0},null,"<- für diesen ProjektBereich",null,{"$f":"SUM(N4:N203)","v":0},{"$f":"SUM(O4:O203)","v":0},{"$f":"SUM(P4:P203)","v":0}]
[null,null,null,{"$f":"IF(C4=\"\", \"\", C4-B4)","v":""},{"$f":"IF(D4=\"\", \"\", (C4-B4)*24)","v":""},null,{"$f":"IF(K4 = selectThisProjekt,E4, \"\")","v":""},{"$f":"IF(F4 = \"\", G4, \"\")","v":""},{"$f":"IF(LOWER(F4) = \"r\",G4,\"\")","v":""},{"$f":"IF(AND(F4<>\"\", LOWER(F4) <> \"r\"),G4,\"\")","v":""},null,null,null,{"$f":"IF(M4<>\"\", \"\", IF(F4 = \"\", G4, \"\"))","v":""},{"$f":"IF(M4<>\"\", \"\", IF(LOWER(F4) = \"r\",G4,\"\"))","v":""},{"$f":"IF(M4<>\"\", \"\", IF(AND(F4<>\"\", LOWER(F4) <> \"r\"),G4,\"\"))","v":""},{"$f":"IF(K4=\"\", \"\", VLOOKUP(K4,Projekte!C:D,2,FALSE))","v":""}]
[null,null,null,"","",null,"",{"$f":"IF(F5 = \"\", G5, \"\")","v":""},{"$f":"IF(LOWER(F5) = \"r\",G5,\"\")","v":""},{"$f":"IF(AND(F5<>\"\", LOWER(F5) <> \"r\"),G5,\"\")","v":""},null,null,null,{"$f":"IF(M5<>\"\", \"\", IF(F5 = \"\", G5, \"\"))","v":""},{"$f":"IF(M5<>\"\", \"\", IF(LOWER(F5) = \"r\",G5,\"\"))","v":""},{"$f":"IF(M5<>\"\", \"\", IF(AND(F5<>\"\", LOWER(F5) <> \"r\"),G5,\"\"))","v":""},{"$f":"IF(K5=\"\", \"\", VLOOKUP(K5,Projekte!C:D,2,FALSE))","v":""}]
[null,null,null,"","",null,"","","","",null,null,null,{"$f":"IF(M6<>\"\", \"\", IF(F6 = \"\", G6, \"\"))","v":""},{"$f":"IF(M6<>\"\", \"\", IF(LOWER(F6) = \"r\",G6,\"\"))","v":""},{"$f":"IF(M6<>\"\", \"\", IF(AND(F6<>\"\", LOWER(F6) <> \"r\"),G6,\"\"))","v":""},{"$f":"IF(K6=\"\", \"\", VLOOKUP(K6,Projekte!C:D,2,FALSE))","v":""}]
[null,null,null,"","",null,"","","","",null,null,null,"","","",{"$f":"IF(K7=\"\", \"\", VLOOKUP(K7,Projekte!C:D,2,FALSE))","v":""}]
[null,null,null,"","",null,"","","","",null,null,null,"","","",{"$f":"IF(K8=\"\", \"\", VLOOKUP(K8,Projekte!C:D,2,FALSE))","v":""}]
[null,null,null,"","",null,"","","","",null,null,null,"","","",{"$f":"IF(K9=\"\", \"\", VLOOKUP(K9,Projekte!C:D,2,FALSE))","v":""}]
[null,null,null,"","",null,"","","","",null,null,null,"","","",{"$f":"IF(K10=\"\", \"\", VLOOKUP(K10,Projekte!C:D,2,FALSE))","v":""}]
[null,null,null,"","",null,"","","","",null,null,null,"","","",{"$f":"IF(K11=\"\", \"\", VLOOKUP(K11,Projekte!C:D,2,FALSE))","v":""}]
[null,null,null,"","",null,"","","","",null,null,null,"","","",{"$f":"IF(K12=\"\", \"\", VLOOKUP(K12,Projekte!C:D,2,FALSE))","v":""}]
[null,null,null,"","",null,"","","","",null,null,null,"","","",{"$f":"IF(K13=\"\", \"\", VLOOKUP(K13,Projekte!C:D,2,FALSE))","v":""}]
[null,null,null,"","",null,"","","","",null,null,null,"","","",{"$f":"IF(K14=\"\", \"\", VLOOKUP(K14,Projekte!C:D,2,FALSE))","v":""}]
[null,null,null,"","",null,"","","","",null,null,null,"","","",{"$f":"IF(K15=\"\", \"\", VLOOKUP(K15,Projekte!C:D,2,FALSE))","v":""}]
[null,null,null,"","",null,"","","","",null,null,null,"","","",{"$f":"IF(K16=\"\", \"\", VLOOKUP(K16,Projekte!C:D,2,FALSE))","v":""}]
[null,null,null,"","",null,"","","","",null,null,null,"","","",{"$f":"IF(K17=\"\", \"\", VLOOKUP(K17,Projekte!C:D,2,FALSE))","v":""}]
[null,null,null,"","",null,"","","","",null,null,null,"","","",{"$f":"IF(K18=\"\", \"\", VLOOKUP(K18,Projekte!C:D,2,FALSE))","v":""}]
[null,null,null,"","",null,"","","","",null,null,null,"","","",{"$f":"IF(K19=\"\", \"\", VLOOKUP(K19,Projekte!C:D,2,FALSE))","v":""}]
[null,null,null,"","",null,"","","","",null,null,null,"","","",{"$f":"IF(K20=\"\", \"\", VLOOKUP(K20,Projekte!C:D,2,FALSE))","v":""}]
[null,null,null,"","",null,"","","","",null,null,null,"","","",{"$f":"IF(K21=\"\", \"\", VLOOKUP(K21,Projekte!C:D,2,FALSE))","v":""}]
[null,null,null,"","",null,"","","","",null,null,null,"","","",{"$f":"IF(K22=\"\", \"\", VLOOKUP(K22,Projekte!C:D,2,FALSE))","v":""}]
[null,null,null,"","",null,"","","","",null,null,null,"","","",{"$f":"IF(K23=\"\", \"\", VLOOKUP(K23,Projekte!C:D,2,FALSE))","v":""}]
[null,null,null,"","",null,"","","","",null,null,null,"","","",{"$f":"IF(K24=\"\", \"\", VLOOKUP(K24,Projekte!C:D,2,FALSE))","v":""}]
[null,null,null,"","",null,"","","","",null,null,null,"","","",{"$f":"IF(K25=\"\", \"\", VLOOKUP(K25,Projekte!C:D,2,FALSE))","v":""}]
[null,null,null,"","",null,"","","","",null,null,null,"","","",{"$f":"IF(K26=\"\", \"\", VLOOKUP(K26,Projekte!C:D,2,FALSE))","v":""}]
[null,null,null,"","",null,"","","","",null,null,null,"","","",{"$f":"IF(K27=\"\", \"\", VLOOKUP(K27,Projekte!C:D,2,FALSE))","v":""}]
[null,null,null,"","",null,"","","","",null,null,null,"","","",{"$f":"IF(K28=\"\", \"\", VLOOKUP(K28,Projekte!C:D,2,FALSE))","v":""}]
[null,null,null,"","",null,"","","","",null,null,null,"","","",{"$f":"IF(K29=\"\", \"\", VLOOKUP(K29,Projekte!C:D,2,FALSE))","v":""}]
[null,null,null,"","",null,"","","","",null,null,null,"","","",{"$f":"IF(K30=\"\", \"\", VLOOKUP(K30,Projekte!C:D,2,FALSE))","v":""}]
[null,null,null,"","",null,"","","","",null,null,null,"","","",{"$f":"IF(K31=\"\", \"\", VLOOKUP(K31,Projekte!C:D,2,FALSE))","v":""}]
[null,null,null,"","",null,"","","","",null,null,null,"","","",{"$f":"IF(K32=\"\", \"\", VLOOKUP(K32,Projekte!C:D,2,FALSE))","v":""}]
[null,null,null,"","",null,"","","","",null,null,null,"","","",{"$f":"IF(K33=\"\", \"\", VLOOKUP(K33,Projekte!C:D,2,FALSE))","v":""}]
[null,null,null,"","",null,"","","","",null,null,null,"","","",{"$f":"IF(K34=\"\", \"\", VLOOKUP(K34,Projekte!C:D,2,FALSE))","v":""}]
[null,null,null,"","",null,"","","","",null,null,null,"","","",{"$f":"IF(K35=\"\", \"\", VLOOKUP(K35,Projekte!C:D,2,FALSE))","v":""}]
[null,null,null,"","",null,{"$f":"IF(K36 = selectThisProjekt,E36, \"\")","v":""},"","","",null,null,null,"","","",{"$f":"IF(K36=\"\", \"\", VLOOKUP(K36,Projekte!C:D,2,FALSE))","v":""}]
[null,null,null,"","",null,"","","","",null,null,null,"","","",{"$f":"IF(K37=\"\", \"\", VLOOKUP(K37,Projekte!C:D,2,FALSE))","v":""}]
[null,null,null,"","",null,"","","","",null,null,null,"","","",{"$f":"IF(K38=\"\", \"\", VLOOKUP(K38,Projekte!C:D,2,FALSE))","v":""}]
[null,null,null,"","",null,"","","","",null,null,null,"","","",{"$f":"IF(K39=\"\", \"\", VLOOKUP(K39,Projekte!C:D,2,FALSE))","v":""}]
[null,null,null,"","",null,"","","","",null,null,null,"","","",{"$f":"IF(K40=\"\", \"\", VLOOKUP(K40,Projekte!C:D,2,FALSE))","v":""}]
[null,null,null,"","",null,"","","","",null,null,null,"","","",{"$f":"IF(K41=\"\", \"\", VLOOKUP(K41,Projekte!C:D,2,FALSE))","v":""}]
[null,null,null,"","",null,"","","","",null,null,null,"","","",{"$f":"IF(K42=\"\", \"\", VLOOKUP(K42,Projekte!C:D,2,FALSE))","v":""}]
[null,null,null,"","",null,"","","","",null,null,null,"","","",{"$f":"IF(K43=\"\", \"\", VLOOKUP(K43,Projekte!C:D,2,FALSE))","v":""}]
[null,null,null,"","",null,"","","","",null,null,null,"","","",{"$f":"IF(K44=\"\", \"\", VLOOKUP(K44,Projekte!C:D,2,FALSE))","v":""}]
[null,null,null,"","",null,"","","","",null,null,null,"","","",{"$f":"IF(K45=\"\", \"\", VLOOKUP(K45,Projekte!C:D,2,FALSE))","v":""}]
[null,null,null,"","",null,"","","","",null,null,null,"","","",{"$f":"IF(K46=\"\", \"\", VLOOKUP(K46,Projekte!C:D,2,FALSE))","v":""}]
[null,null,null,"","",null,"","","","",null,null,null,"","","",{"$f":"IF(K47=\"\", \"\", VLOOKUP(K47,Projekte!C:D,2,FALSE))","v":""}]
[null,null,null,"","",null,"","","","",null,null,null,"","","",{"$f":"IF(K48=\"\", \"\", VLOOKUP(K48,Projekte!C:D,2,FALSE))","v":""}]
[null,null,null,"","",null,"","","","",null,null,null,"","","",{"$f":"IF(K49=\"\", \"\", VLOOKUP(K49,Projekte!C:D,2,FALSE))","v":""}]
[null,null,null,"","",null,"","","","",null,null,null,"","","",{"$f":"IF(K50=\"\", \"\", VLOOKUP(K50,Projekte!C:D,2,FALSE))","v":""}]
[null,null,null,"","",null,"","","","",null,null,null,"","","",{"$f":"IF(K51=\"\", \"\", VLOOKUP(K51,Projekte!C:D,2,FALSE))","v":""}]
[null,null,null,"","",null,"","","","",null,null,null,"","","",{"$f":"IF(K52=\"\", \"\", VLOOKUP(K52,Projekte!C:D,2,FALSE))","v":""}]
[null,null,null,"","",null,"","","","",null,null,null,"","","",{"$f":"IF(K53=\"\", \"\", VLOOKUP(K53,Projekte!C:D,2,FALSE))","v":""}]
[null,null,null,"","",null,"","","","",null,null,null,"","","",{"$f":"IF(K54=\"\", \"\", VLOOKUP(K54,Projekte!C:D,2,FALSE))","v":""}]
[null,null,null,"","",null,"","","","",null,null,null,"","","",{"$f":"IF(K55=\"\", \"\", VLOOKUP(K55,Projekte!C:D,2,FALSE))","v":""}]
[null,null,null,"","",null,"","","","",null,null,null,"","","",{"$f":"IF(K56=\"\", \"\", VLOOKUP(K56,Projekte!C:D,2,FALSE))","v":""}]
[null,null,null,"","",null,"","","","",null,null,null,"","","",{"$f":"IF(K57=\"\", \"\", VLOOKUP(K57,Projekte!C:D,2,FALSE))","v":""}]
[null,null,null,"","",null,"","","","",null,null,null,"","","",{"$f":"IF(K58=\"\", \"\", VLOOKUP(K58,Projekte!C:D,2,FALSE))","v":""}]
[null,null,null,"","",null,"","","","",null,null,null,"","","",{"$f":"IF(K59=\"\", \"\", VLOOKUP(K59,Projekte!C:D,2,FALSE))","v":""}]
[null,null,null,"","",null,"","","","",null,null,null,"","","",{"$f":"IF(K60=\"\", \"\", VLOOKUP(K60,Projekte!C:D,2,FALSE))","v":""}]
[null,null,null,"","",null,"","","","",null,null,null,"","","",{"$f":"IF(K61=\"\", \"\", VLOOKUP(K61,Projekte!C:D,2,FALSE))","v":""}]
[null,null,null,"","",null,"","","","",null,null,null,"","","",{"$f":"IF(K62=\"\", \"\", VLOOKUP(K62,Projekte!C:D,2,FALSE))","v":""}]
[null,null,null,"","",null,"","","","",null,null,null,"","","",{"$f":"IF(K63=\"\", \"\", VLOOKUP(K63,Projekte!C:D,2,FALSE))","v":""}]
[null,null,null,"","",null,"","","","",null,null,null,"","","",{"$f":"IF(K64=\"\", \"\", VLOOKUP(K64,Projekte!C:D,2,FALSE))","v":""}]
[null,null,null,"","",null,"","","","",null,null,null,"","","",{"$f":"IF(K65=\"\", \"\", VLOOKUP(K65,Projekte!C:D,2,FALSE))","v":""}]
[null,null,null,"","",null,"","","","",null,null,null,"","","",{"$f":"IF(K66=\"\", \"\", VLOOKUP(K66,Projekte!C:D,2,FALSE))","v":""}]
[null,null,null,"","",null,"","","","",null,null,null,"","","",{"$f":"IF(K67=\"\", \"\", VLOOKUP(K67,Projekte!C:D,2,FALSE))","v":""}]
[null,null,null,{"$f":"IF(C68=\"\", \"\", C68-B68)","v":""},{"$f":"IF(D68=\"\", \"\", (C68-B68)*24)","v":""},null,{"$f":"IF(K68 = selectThisProjekt,E68, \"\")","v":""},"","","",null,null,null,"","","",{"$f":"IF(K68=\"\", \"\", VLOOKUP(K68,Projekte!C:D,2,FALSE))","v":""}]
[null,null,null,"","",null,"",{"$f":"IF(F69 = \"\", G69, \"\")","v":""},{"$f":"IF(LOWER(F69) = \"r\",G69,\"\")","v":""},{"$f":"IF(AND(F69<>\"\", LOWER(F69) <> \"r\"),G69,\"\")","v":""},null,null,null,"","","",{"$f":"IF(K69=\"\", \"\", VLOOKUP(K69,Projekte!C:D,2,FALSE))","v":""}]
[null,null,null,"","",null,"","","","",null,null,null,{"$f":"IF(M70<>\"\", \"\", IF(F70 = \"\", G70, \"\"))","v":""},{"$f":"IF(M70<>\"\", \"\", IF(LOWER(F70) = \"r\",G70,\"\"))","v":""},{"$f":"IF(M70<>\"\", \"\", IF(AND(F70<>\"\", LOWER(F70) <> \"r\"),G70,\"\"))","v":""},{"$f":"IF(K70=\"\", \"\", VLOOKUP(K70,Projekte!C:D,2,FALSE))","v":""}]
[null,null,null,"","",null,"","","","",null,null,null,"","","",{"$f":"IF(K71=\"\", \"\", VLOOKUP(K71,Projekte!C:D,2,FALSE))","v":""}]
[null,null,null,"","",null,"","","","",null,null,null,"","","",{"$f":"IF(K72=\"\", \"\", VLOOKUP(K72,Projekte!C:D,2,FALSE))","v":""}]
[null,null,null,"","",null,"","","","",null,null,null,"","","",{"$f":"IF(K73=\"\", \"\", VLOOKUP(K73,Projekte!C:D,2,FALSE))","v":""}]
[null,null,null,"","",null,"","","","",null,null,null,"","","",{"$f":"IF(K74=\"\", \"\", VLOOKUP(K74,Projekte!C:D,2,FALSE))","v":""}]
[null,null,null,"","",null,"","","","",null,null,null,"","","",{"$f":"IF(K75=\"\", \"\", VLOOKUP(K75,Projekte!C:D,2,FALSE))","v":""}]
[null,null,null,"","",null,"","","","",null,null,null,"","","",{"$f":"IF(K76=\"\", \"\", VLOOKUP(K76,Projekte!C:D,2,FALSE))","v":""}]
[null,null,null,"","",null,"","","","",null,null,null,"","","",{"$f":"IF(K77=\"\", \"\", VLOOKUP(K77,Projekte!C:D,2,FALSE))","v":""}]
[null,null,null,"","",null,"","","","",null,null,null,"","","",{"$f":"IF(K78=\"\", \"\", VLOOKUP(K78,Projekte!C:D,2,FALSE))","v":""}]
[null,null,null,"","",null,"","","","",null,null,null,"","","",{"$f":"IF(K79=\"\", \"\", VLOOKUP(K79,Projekte!C:D,2,FALSE))","v":""}]
[null,null,null,"","",null,"","","","",null,null,null,"","","",{"$f":"IF(K80=\"\", \"\", VLOOKUP(K80,Projekte!C:D,2,FALSE))","v":""}]
[null,null,null,"","",null,"","","","",null,null,null,"","","",{"$f":"IF(K81=\"\", \"\", VLOOKUP(K81,Projekte!C:D,2,FALSE))","v":""}]
[null,null,null,"","",null,"","","","",null,null,null,"","","",{"$f":"IF(K82=\"\", \"\", VLOOKUP(K82,Projekte!C:D,2,FALSE))","v":""}]
[null,null,null,"","",null,"","","","",null,null,null,"","","",{"$f":"IF(K83=\"\", \"\", VLOOKUP(K83,Projekte!C:D,2,FALSE))","v":""}]
[null,null,null,"","",null,"","","","",null,null,null,"","","",{"$f":"IF(K84=\"\", \"\", VLOOKUP(K84,Projekte!C:D,2,FALSE))","v":""}]
[null,null,null,"","",null,"","","","",null,null,null,"","","",{"$f":"IF(K85=\"\", \"\", VLOOKUP(K85,Projekte!C:D,2,FALSE))","v":""}]
[null,null,null,"","",null,"","","","",null,null,null,"","","",{"$f":"IF(K86=\"\", \"\", VLOOKUP(K86,Projekte!C:D,2,FALSE))","v":""}]
[null,null,null,"","",null,"","","","",null,null,null,"","","",{"$f":"IF(K87=\"\", \"\", VLOOKUP(K87,Projekte!C:D,2,FALSE))","v":""}]
[null,null,null,"","",null,"","","","",null,null,null,"","","",{"$f":"IF(K88=\"\", \"\", VLOOKUP(K88,Projekte!C:D,2,FALSE))","v":""}]
[null,null,null,"","",null,"","","","",null,null,null,"","","",{"$f":"IF(K89=\"\", \"\", VLOOKUP(K89,Projekte!C:D,2,FALSE))","v":""}]
[null,null,null,"","",null,"","","","",null,null,null,"","","",{"$f":"IF(K90=\"\", \"\", VLOOKUP(K90,Projekte!C:D,2,FALSE))","v":""}]
[null,null,null,"","",null,"","","","",null,null,null,"","","",{"$f":"IF(K91=\"\", \"\", VLOOKUP(K91,Projekte!C:D,2,FALSE))","v":""}]
[null,null,null,"","",null,"","","","",null,null,null,"","","",{"$f":"IF(K92=\"\", \"\", VLOOKUP(K92,Projekte!C:D,2,FALSE))","v":""}]
[null,null,null,"","",null,"","","","",null,null,null,"","","",{"$f":"IF(K93=\"\", \"\", VLOOKUP(K93,Projekte!C:D,2,FALSE))","v":""}]
[null,null,null,"","",null,"","","","",null,null,null,"","","",{"$f":"IF(K94=\"\", \"\", VLOOKUP(K94,Projekte!C:D,2,FALSE))","v":""}]
[null,null,null,"","",null,"","","","",null,null,null,"","","",{"$f":"IF(K95=\"\", \"\", VLOOKUP(K95,Projekte!C:D,2,FALSE))","v":""}]
[null,null,null,"","",null,"","","","",null,null,null,"","","",{"$f":"IF(K96=\"\", \"\", VLOOKUP(K96,Projekte!C:D,2,FALSE))","v":""}]
[null,null,null,"","",null,"","","","",null,null,null,"","","",{"$f":"IF(K97=\"\", \"\", VLOOKUP(K97,Projekte!C:D,2,FALSE))","v":""}]
[null,null,null,"","",null,"","","","",null,null,null,"","","",{"$f":"IF(K98=\"\", \"\", VLOOKUP(K98,Projekte!C:D,2,FALSE))","v":""}]
[null,null,null,"","",null,"","","","",null,null,null,"","","",{"$f":"IF(K99=\"\", \"\", VLOOKUP(K99,Projekte!C:D,2,FALSE))","v":""}]
[null,null,null,"","",null,{"$f":"IF(K100 = selectThisProjekt,E100, \"\")","v":""},"","","",null,null,null,"","","",{"$f":"IF(K100=\"\", \"\", VLOOKUP(K100,Projekte!C:D,2,FALSE))","v":""}]
[null,null,null,"","",null,"","","","",null,null,null,"","","",{"$f":"IF(K101=\"\", \"\", VLOOKUP(K101,Projekte!C:D,2,FALSE))","v":""}]
[null,null,null,"","",null,"","","","",null,null,null,"","","",{"$f":"IF(K102=\"\", \"\", VLOOKUP(K102,Projekte!C:D,2,FALSE))","v":""}]
[null,null,null,"","",null,"","","","",null,null,null,"","","",{"$f":"IF(K103=\"\", \"\", VLOOKUP(K103,Projekte!C:D,2,FALSE))","v":""}]
[null,null,null,"","",null,"","","","",null,null,null,"","","",{"$f":"IF(K104=\"\", \"\", VLOOKUP(K104,Projekte!C:D,2,FALSE))","v":""}]
[null,null,null,"","",null,"","","","",null,null,null,"","","",{"$f":"IF(K105=\"\", \"\", VLOOKUP(K105,Projekte!C:D,2,FALSE))","v":""}]
[null,null,null,"","",null,"","","","",null,null,null,"","","",{"$f":"IF(K106=\"\", \"\", VLOOKUP(K106,Projekte!C:D,2,FALSE))","v":""}]
[null,null,null,"","",null,"","","","",null,null,null,"","","",{"$f":"IF(K107=\"\", \"\", VLOOKUP(K107,Projekte!C:D,2,FALSE))","v":""}]
[null,null,null,"","",null,"","","","",null,null,null,"","","",{"$f":"IF(K108=\"\", \"\", VLOOKUP(K108,Projekte!C:D,2,FALSE))","v":""}]
[null,null,null,"","",null,"","","","",null,null,null,"","","",{"$f":"IF(K109=\"\", \"\", VLOOKUP(K109,Projekte!C:D,2,FALSE))","v":""}]
[null,null,null,"","",null,"","","","",null,null,null,"","","",{"$f":"IF(K110=\"\", \"\", VLOOKUP(K110,Projekte!C:D,2,FALSE))","v":""}]
[null,null,null,"","",null,"","","","",null,null,null,"","","",{"$f":"IF(K111=\"\", \"\", VLOOKUP(K111,Projekte!C:D,2,FALSE))","v":""}]
[null,null,null,"","",null,"","","","",null,null,null,"","","",{"$f":"IF(K112=\"\", \"\", VLOOKUP(K112,Projekte!C:D,2,FALSE))","v":""}]
[null,null,null,"","",null,"","","","",null,null,null,"","","",{"$f":"IF(K113=\"\", \"\", VLOOKUP(K113,Projekte!C:D,2,FALSE))","v":""}]
[null,null,null,"","",null,"","","","",null,null,null,"","","",{"$f":"IF(K114=\"\", \"\", VLOOKUP(K114,Projekte!C:D,2,FALSE))","v":""}]
[null,null,null,"","",null,"","","","",null,null,null,"","","",{"$f":"IF(K115=\"\", \"\", VLOOKUP(K115,Projekte!C:D,2,FALSE))","v":""}]
[null,null,null,"","",null,"","","","",null,null,null,"","","",{"$f":"IF(K116=\"\", \"\", VLOOKUP(K116,Projekte!C:D,2,FALSE))","v":""}]
[null,null,null,"","",null,"","","","",null,null,null,"","","",{"$f":"IF(K117=\"\", \"\", VLOOKUP(K117,Projekte!C:D,2,FALSE))","v":""}]
[null,null,null,"","",null,"","","","",null,null,null,"","","",{"$f":"IF(K118=\"\", \"\", VLOOKUP(K118,Projekte!C:D,2,FALSE))","v":""}]
[null,null,null,"","",null,"","","","",null,null,null,"","","",{"$f":"IF(K119=\"\", \"\", VLOOKUP(K119,Projekte!C:D,2,FALSE))","v":""}]
[null,null,null,"","",null,"","","","",null,null,null,"","","",{"$f":"IF(K120=\"\", \"\", VLOOKUP(K120,Projekte!C:D,2,FALSE))","v":""}]
[null,null,null,"","",null,"","","","",null,null,null,"","","",{"$f":"IF(K121=\"\", \"\", VLOOKUP(K121,Projekte!C:D,2,FALSE))","v":""}]
[null,null,null,"","",null,"","","","",null,null,null,"","","",{"$f":"IF(K122=\"\", \"\", VLOOKUP(K122,Projekte!C:D,2,FALSE))","v":""}]
[null,null,null,"","",null,{"$f":"IF(K123 = selectThisProjekt,E123, \"\")","v":""},"","","",null,null,null,"","","",{"$f":"IF(K123=\"\", \"\", VLOOKUP(K123,Projekte!C:D,2,FALSE))","v":""}]
[null,null,null,"","",null,"","","","",null,null,null,"","","",{"$f":"IF(K124=\"\", \"\", VLOOKUP(K124,Projekte!C:D,2,FALSE))","v":""}]
[null,null,null,"","",null,{"$f":"IF(K125 = selectThisProjekt,E125, \"\")","v":""},"","","",null,null,null,"","","",{"$f":"IF(K125=\"\", \"\", VLOOKUP(K125,Projekte!C:D,2,FALSE))","v":""}]
[null,null,null,"","",null,"","","","",null,null,null,"","","",{"$f":"IF(K126=\"\", \"\", VLOOKUP(K126,Projekte!C:D,2,FALSE))","v":""}]
[null,null,null,"","",null,"","","","",null,null,null,"","","",{"$f":"IF(K127=\"\", \"\", VLOOKUP(K127,Projekte!C:D,2,FALSE))","v":""}]
[null,null,null,"","",null,"","","","",null,null,null,"","","",{"$f":"IF(K128=\"\", \"\", VLOOKUP(K128,Projekte!C:D,2,FALSE))","v":""}]
[null,null,null,"","",null,"","","","",null,null,null,"","","",{"$f":"IF(K129=\"\", \"\", VLOOKUP(K129,Projekte!C:D,2,FALSE))","v":""}]
[null,null,null,"","",null,"","","","",null,null,null,"","","",{"$f":"IF(K130=\"\", \"\", VLOOKUP(K130,Projekte!C:D,2,FALSE))","v":""}]
[null,null,null,"","",null,"","","","",null,null,null,"","","",{"$f":"IF(K131=\"\", \"\", VLOOKUP(K131,Projekte!C:D,2,FALSE))","v":""}]
[null,null,null,{"$f":"IF(C132=\"\", \"\", C132-B132)","v":""},{"$f":"IF(D132=\"\", \"\", (C132-B132)*24)","v":""},null,{"$f":"IF(K132 = selectThisProjekt,E132, \"\")","v":""},"","","",null,null,null,"","","",{"$f":"IF(K132=\"\", \"\", VLOOKUP(K132,Projekte!C:D,2,FALSE))","v":""}]
[null,null,null,"","",null,"",{"$f":"IF(F133 = \"\", G133, \"\")","v":""},{"$f":"IF(LOWER(F133) = \"r\",G133,\"\")","v":""},{"$f":"IF(AND(F133<>\"\", LOWER(F133) <> \"r\"),G133,\"\")","v":""},null,null,null,"","","",{"$f":"IF(K133=\"\", \"\", VLOOKUP(K133,Projekte!C:D,2,FALSE))","v":""}]
[null,null,null,"","",null,"","","","",null,null,null,{"$f":"IF(M134<>\"\", \"\", IF(F134 = \"\", G134, \"\"))","v":""},{"$f":"IF(M134<>\"\", \"\", IF(LOWER(F134) = \"r\",G134,\"\"))","v":""},{"$f":"IF(M134<>\"\", \"\", IF(AND(F134<>\"\", LOWER(F134) <> \"r\"),G134,\"\"))","v":""},{"$f":"IF(K134=\"\", \"\", VLOOKUP(K134,Projekte!C:D,2,FALSE))","v":""}]
[null,null,null,"","",null,"","","","",null,null,null,"","","",{"$f":"IF(K135=\"\", \"\", VLOOKUP(K135,Projekte!C:D,2,FALSE))","v":""}]
[null,null,null,"","",null,"","","","",null,null,null,"","","",{"$f":"IF(K136=\"\", \"\", VLOOKUP(K136,Projekte!C:D,2,FALSE))","v":""}]
[null,null,null,"","",null,"","","","",null,null,null,"","","",{"$f":"IF(K137=\"\", \"\", VLOOKUP(K137,Projekte!C:D,2,FALSE))","v":""}]
[null,null,null,"","",null,"","","","",null,null,null,"","","",{"$f":"IF(K138=\"\", \"\", VLOOKUP(K138,Projekte!C:D,2,FALSE))","v":""}]
[null,null,null,"","",null,"","","","",null,null,null,"","","",{"$f":"IF(K139=\"\", \"\", VLOOKUP(K139,Projekte!C:D,2,FALSE))","v":""}]
[null,null,null,"","",null,"","","","",null,null,null,"","","",{"$f":"IF(K140=\"\", \"\", VLOOKUP(K140,Projekte!C:D,2,FALSE))","v":""}]
[null,null,null,"","",null,"","","","",null,null,null,"","","",{"$f":"IF(K141=\"\", \"\", VLOOKUP(K141,Projekte!C:D,2,FALSE))","v":""}]
[null,null,null,"","",null,"","","","",null,null,null,"","","",{"$f":"IF(K142=\"\", \"\", VLOOKUP(K142,Projekte!C:D,2,FALSE))","v":""}]
[null,null,null,"","",null,"","","","",null,null,null,"","","",{"$f":"IF(K143=\"\", \"\", VLOOKUP(K143,Projekte!C:D,2,FALSE))","v":""}]
[null,null,null,"","",null,"","","","",null,null,null,"","","",{"$f":"IF(K144=\"\", \"\", VLOOKUP(K144,Projekte!C:D,2,FALSE))","v":""}]
[null,null,null,"","",null,"","","","",null,null,null,"","","",{"$f":"IF(K145=\"\", \"\", VLOOKUP(K145,Projekte!C:D,2,FALSE))","v":""}]
[null,null,null,"","",null,"","","","",null,null,null,"","","",{"$f":"IF(K146=\"\", \"\", VLOOKUP(K146,Projekte!C:D,2,FALSE))","v":""}]
[null,null,null,"","",null,"","","","",null,null,null,"","","",{"$f":"IF(K147=\"\", \"\", VLOOKUP(K147,Projekte!C:D,2,FALSE))","v":""}]
[null,null,null,"","",null,"","","","",null,null,null,"","","",{"$f":"IF(K148=\"\", \"\", VLOOKUP(K148,Projekte!C:D,2,FALSE))","v":""}]
[null,null,null,"","",null,"","","","",null,null,null,"","","",{"$f":"IF(K149=\"\", \"\", VLOOKUP(K149,Projekte!C:D,2,FALSE))","v":""}]
[null,null,null,"","",null,"","","","",null,null,null,"","","",{"$f":"IF(K150=\"\", \"\", VLOOKUP(K150,Projekte!C:D,2,FALSE))","v":""}]
[null,null,null,"","",null,"","","","",null,null,null,"","","",{"$f":"IF(K151=\"\", \"\", VLOOKUP(K151,Projekte!C:D,2,FALSE))","v":""}]
[null,null,null,"","",null,"","","","",null,null,null,"","","",{"$f":"IF(K152=\"\", \"\", VLOOKUP(K152,Projekte!C:D,2,FALSE))","v":""}]
[null,null,null,"","",null,"","","","",null,null,null,"","","",{"$f":"IF(K153=\"\", \"\", VLOOKUP(K153,Projekte!C:D,2,FALSE))","v":""}]
[null,null,null,"","",null,"","","","",null,null,null,"","","",{"$f":"IF(K154=\"\", \"\", VLOOKUP(K154,Projekte!C:D,2,FALSE))","v":""}]
[null,null,null,"","",null,"","","","",null,null,null,"","","",{"$f":"IF(K155=\"\", \"\", VLOOKUP(K155,Projekte!C:D,2,FALSE))","v":""}]
[null,null,null,"","",null,"","","","",null,null,null,"","","",{"$f":"IF(K156=\"\", \"\", VLOOKUP(K156,Projekte!C:D,2,FALSE))","v":""}]
[null,null,null,"","",null,"","","","",null,null,null,"","","",{"$f":"IF(K157=\"\", \"\", VLOOKUP(K157,Projekte!C:D,2,FALSE))","v":""}]
[null,null,null,"","",null,"","","","",null,null,null,"","","",{"$f":"IF(K158=\"\", \"\", VLOOKUP(K158,Projekte!C:D,2,FALSE))","v":""}]
[null,null,null,"","",null,"","","","",null,null,null,"","","",{"$f":"IF(K159=\"\", \"\", VLOOKUP(K159,Projekte!C:D,2,FALSE))","v":""}]
[null,null,null,"","",null,"","","","",null,null,null,"","","",{"$f":"IF(K160=\"\", \"\", VLOOKUP(K160,Projekte!C:D,2,FALSE))","v":""}]
[null,null,null,"","",null,"","","","",null,null,null,"","","",{"$f":"IF(K161=\"\", \"\", VLOOKUP(K161,Projekte!C:D,2,FALSE))","v":""}]
[null,null,null,"","",null,"","","","",null,null,null,"","","",{"$f":"IF(K162=\"\", \"\", VLOOKUP(K162,Projekte!C:D,2,FALSE))","v":""}]
[null,null,null,"","",null,"","","","",null,null,null,"","","",{"$f":"IF(K163=\"\", \"\", VLOOKUP(K163,Projekte!C:D,2,FALSE))","v":""}]
[null,null,null,"","",null,{"$f":"IF(K164 = selectThisProjekt,E164, \"\")","v":""},"","","",null,null,null,"","","",{"$f":"IF(K164=\"\", \"\", VLOOKUP(K164,Projekte!C:D,2,FALSE))","v":""}]
[null,null,null,"","",null,"","","","",null,null,null,"","","",{"$f":"IF(K165=\"\", \"\", VLOOKUP(K165,Projekte!C:D,2,FALSE))","v":""}]
[null,null,null,"","",null,"","","","",null,null,null,"","","",{"$f":"IF(K166=\"\", \"\", VLOOKUP(K166,Projekte!C:D,2,FALSE))","v":""}]
[null,null,null,"","",null,"","","","",null,null,null,"","","",{"$f":"IF(K167=\"\", \"\", VLOOKUP(K167,Projekte!C:D,2,FALSE))","v":""}]
[null,null,null,"","",null,"","","","",null,null,null,"","","",{"$f":"IF(K168=\"\", \"\", VLOOKUP(K168,Projekte!C:D,2,FALSE))","v":""}]
[null,null,null,"","",null,"","","","",null,null,null,"","","",{"$f":"IF(K169=\"\", \"\", VLOOKUP(K169,Projekte!C:D,2,FALSE))","v":""}]
[null,null,null,"","",null,{"$f":"IF(K170 = selectThisProjekt,E170, \"\")","v":""},"","","",null,null,null,"","","",{"$f":"IF(K170=\"\", \"\", VLOOKUP(K170,Projekte!C:D,2,FALSE))","v":""}]
[null,null,null,"","",null,"","","","",null,null,null,"","","",{"$f":"IF(K171=\"\", \"\", VLOOKUP(K171,Projekte!C:D,2,FALSE))","v":""}]
[null,null,null,"","",null,"","","","",null,null,null,"","","",{"$f":"IF(K172=\"\", \"\", VLOOKUP(K172,Projekte!C:D,2,FALSE))","v":""}]
[null,null,null,"","",null,"","","","",null,null,null,"","","",{"$f":"IF(K173=\"\", \"\", VLOOKUP(K173,Projekte!C:D,2,FALSE))","v":""}]
[null,null,null,"","",null,"","","","",null,null,null,"","","",{"$f":"IF(K174=\"\", \"\", VLOOKUP(K174,Projekte!C:D,2,FALSE))","v":""}]
[null,null,null,"","",null,"","","","",null,null,null,"","","",{"$f":"IF(K175=\"\", \"\", VLOOKUP(K175,Projekte!C:D,2,FALSE))","v":""}]
[null,null,null,"","",null,"","","","",null,null,null,"","","",{"$f":"IF(K176=\"\", \"\", VLOOKUP(K176,Projekte!C:D,2,FALSE))","v":""}]
[null,null,null,"","",null,"","","","",null,null,null,"","","",{"$f":"IF(K177=\"\", \"\", VLOOKUP(K177,Projekte!C:D,2,FALSE))","v":""}]
[null,null,null,"","",null,"","","","",null,null,null,"","","",{"$f":"IF(K178=\"\", \"\", VLOOKUP(K178,Projekte!C:D,2,FALSE))","v":""}]
[null,null,null,"","",null,"","","","",null,null,null,"","","",{"$f":"IF(K179=\"\", \"\", VLOOKUP(K179,Projekte!C:D,2,FALSE))","v":""}]
[null,null,null,"","",null,"","","","",null,null,null,"","","",{"$f":"IF(K180=\"\", \"\", VLOOKUP(K180,Projekte!C:D,2,FALSE))","v":""}]
[null,null,null,"","",null,"","","","",null,null,null,"","","",{"$f":"IF(K181=\"\", \"\", VLOOKUP(K181,Projekte!C:D,2,FALSE))","v":""}]
[null,null,null,"","",null,"","","","",null,null,null,"","","",{"$f":"IF(K182=\"\", \"\", VLOOKUP(K182,Projekte!C:D,2,FALSE))","v":""}]
[null,null,null,"","",null,"","","","",null,null,null,"","","",{"$f":"IF(K183=\"\", \"\", VLOOKUP(K183,Projekte!C:D,2,FALSE))","v":""}]
[null,null,null,"","",null,"","","","",null,null,null,"","","",{"$f":"IF(K184=\"\", \"\", VLOOKUP(K184,Projekte!C:D,2,FALSE))","v":""}]
[null,null,null,"","",null,"","","","",null,null,null,"","","",{"$f":"IF(K185=\"\", \"\", VLOOKUP(K185,Projekte!C:D,2,FALSE))","v":""}]
[null,null,null,"","",null,"","","","",null,null,null,"","","",{"$f":"IF(K186=\"\", \"\", VLOOKUP(K186,Projekte!C:D,2,FALSE))","v":""}]
[null,null,null,"","",null,"","","","",null,null,null,"","","",{"$f":"IF(K187=\"\", \"\", VLOOKUP(K187,Projekte!C:D,2,FALSE))","v":""}]
[null,null,null,"","",null,"","","","",null,null,null,"","","",{"$f":"IF(K188=\"\", \"\", VLOOKUP(K188,Projekte!C:D,2,FALSE))","v":""}]
[null,null,null,"","",null,"","","","",null,null,null,"","","",{"$f":"IF(K189=\"\", \"\", VLOOKUP(K189,Projekte!C:D,2,FALSE))","v":""}]
[null,null,null,"","",null,"","","","",null,null,null,"","","",{"$f":"IF(K190=\"\", \"\", VLOOKUP(K190,Projekte!C:D,2,FALSE))","v":""}]
[null,null,null,"","",null,"","","","",null,null,null,"","","",{"$f":"IF(K191=\"\", \"\", VLOOKUP(K191,Projekte!C:D,2,FALSE))","v":""}]
[null,null,null,"","",null,"","","","",null,null,null,"","","",{"$f":"IF(K192=\"\", \"\", VLOOKUP(K192,Projekte!C:D,2,FALSE))","v":""}]
[null,null,null,"","",null,"","","","",null,null,null,"","","",{"$f":"IF(K193=\"\", \"\", VLOOKUP(K193,Projekte!C:D,2,FALSE))","v":""}]
[null,null,null,"","",null,"","","","",null,null,null,"","","",{"$f":"IF(K194=\"\", \"\", VLOOKUP(K194,Projekte!C:D,2,FALSE))","v":""}]
[null,null,null,"","",null,"","","","",null,null,null,"","","",{"$f":"IF(K195=\"\", \"\", VLOOKUP(K195,Projekte!C:D,2,FALSE))","v":""}]
[null,null,null,"","",null,"","","","",null,null,null,"","","",{"$f":"IF(K196=\"\", \"\", VLOOKUP(K196,Projekte!C:D,2,FALSE))","v":""}]
[null,null,null,"","",null,"","","","",null,null,null,"","","",{"$f":"IF(K197=\"\", \"\", VLOOKUP(K197,Projekte!C:D,2,FALSE))","v":""}]
[null,null,null,"","",null,"","","","",null,null,null,{"$f":"IF(M198<>\"\", \"\", IF(F198 = \"\", G198, \"\"))","v":""},{"$f":"IF(M198<>\"\", \"\", IF(LOWER(F198) = \"r\",G198,\"\"))","v":""},{"$f":"IF(M198<>\"\", \"\", IF(AND(F198<>\"\", LOWER(F198) <> \"r\"),G198,\"\"))","v":""},{"$f":"IF(K198=\"\", \"\", VLOOKUP(K198,Projekte!C:D,2,FALSE))","v":""}]
[null,null,null,"","",null,"","","","",null,null,null,"","","",{"$f":"IF(K199=\"\", \"\", VLOOKUP(K199,Projekte!C:D,2,FALSE))","v":""}]
[null,null,null,"","",null,"","","","",null,null,null,"","","",{"$f":"IF(K200=\"\", \"\", VLOOKUP(K200,Projekte!C:D,2,FALSE))","v":""}]
[null,null,null,"","",null,"","","","",null,null,null,"","","",{"$f":"IF(K201=\"\", \"\", VLOOKUP(K201,Projekte!C:D,2,FALSE))","v":""}]
[null,null,null,"","",null,"","","","",null,null,null,"","","",{"$f":"IF(K202=\"\", \"\", VLOOKUP(K202,Projekte!C:D,2,FALSE))","v":""}]
[null,null,null,"","",null,{"$f":"IF(K203 = selectThisProjekt,E203, \"\")","v":""},"","","",null,null,null,"","","",{"$f":"IF(K203=\"\", \"\", VLOOKUP(K203,Projekte!C:D,2,FALSE))","v":""}]
[null,null,null,"<Ende Formeln>"]

{"sheet":"Aug","index":8,"n_rows":237,"n_cols":17,"rows_kept":237,"cut":false,"hidden":false,"merged":[[0,13,0,15],[2,0,2,2]]}
[null,null,"DL-Zeiten von",{"$f":"AssignedToCfg","v":{"$error":"#REF!"}},null,null,null,null,null,null,null,null,null,"Faktura nicht erfasst"]
["Datum","Beginn","Ende","h","h,xx","r: Reise, \nx: nicht berechnen","Summe","Dienstleistung","Reise","nicht berechnen",null,"Tätigkeit","Faktura erfasst","Dienstleistung","Reise","nicht berechnen","Projektname"]
[null,null,null,null,null,"Summe",{"$f":"SUM(G4:G236)","v":0},{"$f":"SUM(H4:H236)","v":0},{"$f":"SUM(I4:I236)","v":0},{"$f":"SUM(J4:J236)","v":0},null,"<- für diesen ProjektBereich",null,{"$f":"SUM(N4:N236)","v":0},{"$f":"SUM(O4:O236)","v":0},{"$f":"SUM(P4:P236)","v":0}]
[null,null,null,{"$f":"IF(C4=\"\", \"\", C4-B4)","v":""},{"$f":"IF(D4=\"\", \"\", (C4-B4)*24)","v":""},null,{"$f":"IF(K4 = selectThisProjekt,E4, \"\")","v":""},{"$f":"IF(F4 = \"\", G4, \"\")","v":""},{"$f":"IF(LOWER(F4) = \"r\",G4,\"\")","v":""},{"$f":"IF(AND(F4<>\"\", LOWER(F4) <> \"r\"),G4,\"\")","v":""},null,null,null,{"$f":"IF(M4<>\"\", \"\", IF(F4 = \"\", G4, \"\"))","v":""},{"$f":"IF(M4<>\"\", \"\", IF(LOWER(F4) = \"r\",G4,\"\"))","v":""},{"$f":"IF(M4<>\"\", \"\", IF(AND(F4<>\"\", LOWER(F4) <> \"r\"),G4,\"\"))","v":""},{"$f":"IF(K4=\"\", \"\", VLOOKUP(K4,Projekte!C:D,2,FALSE))","v":""}]
[null,null,null,"","",null,"",{"$f":"IF(F5 = \"\", G5, \"\")","v":""},{"$f":"IF(LOWER(F5) = \"r\",G5,\"\")","v":""},{"$f":"IF(AND(F5<>\"\", LOWER(F5) <> \"r\"),G5,\"\")","v":""},null,null,null,{"$f":"IF(M5<>\"\", \"\", IF(F5 = \"\", G5, \"\"))","v":""},{"$f":"IF(M5<>\"\", \"\", IF(LOWER(F5) = \"r\",G5,\"\"))","v":""},{"$f":"IF(M5<>\"\", \"\", IF(AND(F5<>\"\", LOWER(F5) <> \"r\"),G5,\"\"))","v":""},{"$f":"IF(K5=\"\", \"\", VLOOKUP(K5,Projekte!C:D,2,FALSE))","v":""}]
[null,null,null,"","",null,"","","","",null,null,null,{"$f":"IF(M6<>\"\", \"\", IF(F6 = \"\", G6, \"\"))","v":""},{"$f":"IF(M6<>\"\", \"\", IF(LOWER(F6) = \"r\",G6,\"\"))","v":""},{"$f":"IF(M6<>\"\", \"\", IF(AND(F6<>\"\", LOWER(F6) <> \"r\"),G6,\"\"))","v":""},{"$f":"IF(K6=\"\", \"\", VLOOKUP(K6,Projekte!C:D,2,FALSE))","v":""}]
[null,null,null,"","",null,"","","","",null,null,null,"","","",{"$f":"IF(K7=\"\", \"\", VLOOKUP(K7,Projekte!C:D,2,FALSE))","v":""}]
[null,null,null,"","",null,"","","","",null,null,null,"","","",{"$f":"IF(K8=\"\", \"\", VLOOKUP(K8,Projekte!C:D,2,FALSE))","v":""}]
[null,null,null,"","",null,"","","","",null,null,null,"","","",{"$f":"IF(K9=\"\", \"\", VLOOKUP(K9,Projekte!C:D,2,FALSE))","v":""}]
[null,null,null,"","",null,"","","","",null,null,null,"","","",{"$f":"IF(K10=\"\", \"\", VLOOKUP(K10,Projekte!C:D,2,FALSE))","v":""}]
[null,null,null,"","",null,"","","","",null,null,null,"","","",{"$f":"IF(K11=\"\", \"\", VLOOKUP(K11,Projekte!C:D,2,FALSE))","v":""}]
[null,null,null,"","",null,"","","","",null,null,null,"","","",{"$f":"IF(K12=\"\", \"\", VLOOKUP(K12,Projekte!C:D,2,FALSE))","v":""}]
[null,null,null,"","",null,"","","","",null,null,null,"","","",{"$f":"IF(K13=\"\", \"\", VLOOKUP(K13,Projekte!C:D,2,FALSE))","v":""}]
[null,null,null,"","",null,"","","","",null,null,null,"","","",{"$f":"IF(K14=\"\", \"\", VLOOKUP(K14,Projekte!C:D,2,FALSE))","v":""}]
[null,null,null,"","",null,"","","","",null,null,null,"","","",{"$f":"IF(K15=\"\", \"\", VLOOKUP(K15,Projekte!C:D,2,FALSE))","v":""}]
[null,null,null,"","",null,"","","","",null,null,null,"","","",{"$f":"IF(K16=\"\", \"\", VLOOKUP(K16,Projekte!C:D,2,FALSE))","v":""}]
[null,null,null,"","",null,"","","","",null,null,null,"","","",{"$f":"IF(K17=\"\", \"\", VLOOKUP(K17,Projekte!C:D,2,FALSE))","v":""}]
[null,null,null,"","",null,"","","","",null,null,null,"","","",{"$f":"IF(K18=\"\", \"\", VLOOKUP(K18,Projekte!C:D,2,FALSE))","v":""}]
[null,null,null,"","",null,"","","","",null,null,null,"","","",{"$f":"IF(K19=\"\", \"\", VLOOKUP(K19,Projekte!C:D,2,FALSE))","v":""}]
[null,null,null,"","",null,"","","","",null,null,null,"","","",{"$f":"IF(K20=\"\", \"\", VLOOKUP(K20,Projekte!C:D,2,FALSE))","v":""}]
[null,null,null,"","",null,"","","","",null,null,null,"","","",{"$f":"IF(K21=\"\", \"\", VLOOKUP(K21,Projekte!C:D,2,FALSE))","v":""}]
[null,null,null,"","",null,"","","","",null,null,null,"","","",{"$f":"IF(K22=\"\", \"\", VLOOKUP(K22,Projekte!C:D,2,FALSE))","v":""}]
[null,null,null,"","",null,"","","","",null,null,null,"","","",{"$f":"IF(K23=\"\", \"\", VLOOKUP(K23,Projekte!C:D,2,FALSE))","v":""}]
[null,null,null,"","",null,"","","","",null,null,null,"","","",{"$f":"IF(K24=\"\", \"\", VLOOKUP(K24,Projekte!C:D,2,FALSE))","v":""}]
[null,null,null,"","",null,"","","","",null,null,null,"","","",{"$f":"IF(K25=\"\", \"\", VLOOKUP(K25,Projekte!C:D,2,FALSE))","v":""}]
[null,null,null,"","",null,"","","","",null,null,null,"","","",{"$f":"IF(K26=\"\", \"\", VLOOKUP(K26,Projekte!C:D,2,FALSE))","v":""}]
[null,null,null,"","",null,"","","","",null,null,null,"","","",{"$f":"IF(K27=\"\", \"\", VLOOKUP(K27,Projekte!C:D,2,FALSE))","v":""}]
[null,null,null,"","",null,"","","","",null,null,null,"","","",{"$f":"IF(K28=\"\", \"\", VLOOKUP(K28,Projekte!C:D,2,FALSE))","v":""}]
[null,null,null,"","",null,"","","","",null,null,null,"","","",{"$f":"IF(K29=\"\", \"\", VLOOKUP(K29,Projekte!C:D,2,FALSE))","v":""}]
[null,null,null,"","",null,"","","","",null,null,null,"","","",{"$f":"IF(K30=\"\", \"\", VLOOKUP(K30,Projekte!C:D,2,FALSE))","v":""}]
[null,null,null,"","",null,"","","","",null,null,null,"","","",{"$f":"IF(K31=\"\", \"\", VLOOKUP(K31,Projekte!C:D,2,FALSE))","v":""}]
[null,null,null,"","",null,"","","","",null,null,null,"","","",{"$f":"IF(K32=\"\", \"\", VLOOKUP(K32,Projekte!C:D,2,FALSE))","v":""}]
[null,null,null,"","",null,"","","","",null,null,null,"","","",{"$f":"IF(K33=\"\", \"\", VLOOKUP(K33,Projekte!C:D,2,FALSE))","v":""}]
[null,null,null,"","",null,"","","","",null,null,null,"","","",{"$f":"IF(K34=\"\", \"\", VLOOKUP(K34,Projekte!C:D,2,FALSE))","v":""}]
[null,null,null,"","",null,"","","","",null,null,null,"","","",{"$f":"IF(K35=\"\", \"\", VLOOKUP(K35,Projekte!C:D,2,FALSE))","v":""}]
[null,null,null,"","",null,{"$f":"IF(K36 = selectThisProjekt,E36, \"\")","v":""},"","","",null,null,null,"","","",{"$f":"IF(K36=\"\", \"\", VLOOKUP(K36,Projekte!C:D,2,FALSE))","v":""}]
[null,null,null,"","",null,"","","","",null,null,null,"","","",{"$f":"IF(K37=\"\", \"\", VLOOKUP(K37,Projekte!C:D,2,FALSE))","v":""}]
[null,null,null,"","",null,"","","","",null,null,null,"","","",{"$f":"IF(K38=\"\", \"\", VLOOKUP(K38,Projekte!C:D,2,FALSE))","v":""}]
[null,null,null,"","",null,"","","","",null,null,null,"","","",{"$f":"IF(K39=\"\", \"\", VLOOKUP(K39,Projekte!C:D,2,FALSE))","v":""}]
[null,null,null,"","",null,"","","","",null,null,null,"","","",{"$f":"IF(K40=\"\", \"\", VLOOKUP(K40,Projekte!C:D,2,FALSE))","v":""}]
[null,null,null,"","",null,"","","","",null,null,null,"","","",{"$f":"IF(K41=\"\", \"\", VLOOKUP(K41,Projekte!C:D,2,FALSE))","v":""}]
[null,null,null,"","",null,"","","","",null,null,null,"","","",{"$f":"IF(K42=\"\", \"\", VLOOKUP(K42,Projekte!C:D,2,FALSE))","v":""}]
[null,null,null,"","",null,"","","","",null,null,null,"","","",{"$f":"IF(K43=\"\", \"\", VLOOKUP(K43,Projekte!C:D,2,FALSE))","v":""}]
[null,null,null,"","",null,"","","","",null,null,null,"","","",{"$f":"IF(K44=\"\", \"\", VLOOKUP(K44,Projekte!C:D,2,FALSE))","v":""}]
[null,null,null,"","",null,"","","","",null,null,null,"","","",{"$f":"IF(K45=\"\", \"\", VLOOKUP(K45,Projekte!C:D,2,FALSE))","v":""}]
[null,null,null,"","",null,"","","","",null,null,null,"","","",{"$f":"IF(K46=\"\", \"\", VLOOKUP(K46,Projekte!C:D,2,FALSE))","v":""}]
[null,null,null,"","",null,"","","","",null,null,null,"","","",{"$f":"IF(K47=\"\", \"\", VLOOKUP(K47,Projekte!C:D,2,FALSE))","v":""}]
[null,null,null,"","",null,"","","","",null,null,null,"","","",{"$f":"IF(K48=\"\", \"\", VLOOKUP(K48,Projekte!C:D,2,FALSE))","v":""}]
[null,null,null,"","",null,"","","","",null,null,null,"","","",{"$f":"IF(K49=\"\", \"\", VLOOKUP(K49,Projekte!C:D,2,FALSE))","v":""}]
[null,null,null,"","",null,"","","","",null,null,null,"","","",{"$f":"IF(K50=\"\", \"\", VLOOKUP(K50,Projekte!C:D,2,FALSE))","v":""}]
[null,null,null,"","",null,"","","","",null,null,null,"","","",{"$f":"IF(K51=\"\", \"\", VLOOKUP(K51,Projekte!C:D,2,FALSE))","v":""}]
[null,null,null,"","",null,"","","","",null,null,null,"","","",{"$f":"IF(K52=\"\", \"\", VLOOKUP(K52,Projekte!C:D,2,FALSE))","v":""}]
[null,null,null,"","",null,"","","","",null,null,null,"","","",{"$f":"IF(K53=\"\", \"\", VLOOKUP(K53,Projekte!C:D,2,FALSE))","v":""}]
[null,null,null,"","",null,"","","","",null,null,null,"","","",{"$f":"IF(K54=\"\", \"\", VLOOKUP(K54,Projekte!C:D,2,FALSE))","v":""}]
[null,null,null,"","",null,"","","","",null,null,null,"","","",{"$f":"IF(K55=\"\", \"\", VLOOKUP(K55,Projekte!C:D,2,FALSE))","v":""}]
[null,null,null,"","",null,"","","","",null,null,null,"","","",{"$f":"IF(K56=\"\", \"\", VLOOKUP(K56,Projekte!C:D,2,FALSE))","v":""}]
[null,null,null,"","",null,"","","","",null,null,null,"","","",{"$f":"IF(K57=\"\", \"\", VLOOKUP(K57,Projekte!C:D,2,FALSE))","v":""}]
[null,null,null,"","",null,"","","","",null,null,null,"","","",{"$f":"IF(K58=\"\", \"\", VLOOKUP(K58,Projekte!C:D,2,FALSE))","v":""}]
[null,null,null,"","",null,"","","","",null,null,null,"","","",{"$f":"IF(K59=\"\", \"\", VLOOKUP(K59,Projekte!C:D,2,FALSE))","v":""}]
[null,null,null,"","",null,"","","","",null,null,null,"","","",{"$f":"IF(K60=\"\", \"\", VLOOKUP(K60,Projekte!C:D,2,FALSE))","v":""}]
[null,null,null,"","",null,"","","","",null,null,null,"","","",{"$f":"IF(K61=\"\", \"\", VLOOKUP(K61,Projekte!C:D,2,FALSE))","v":""}]
[null,null,null,"","",null,"","","","",null,null,null,"","","",{"$f":"IF(K62=\"\", \"\", VLOOKUP(K62,Projekte!C:D,2,FALSE))","v":""}]
[null,null,null,"","",null,"","","","",null,null,null,"","","",{"$f":"IF(K63=\"\", \"\", VLOOKUP(K63,Projekte!C:D,2,FALSE))","v":""}]
[null,null,null,"","",null,"","","","",null,null,null,"","","",{"$f":"IF(K64=\"\", \"\", VLOOKUP(K64,Projekte!C:D,2,FALSE))","v":""}]
[null,null,null,"","",null,"","","","",null,null,null,"","","",{"$f":"IF(K65=\"\", \"\", VLOOKUP(K65,Projekte!C:D,2,FALSE))","v":""}]
[null,null,null,"","",null,"","","","",null,null,null,"","","",{"$f":"IF(K66=\"\", \"\", VLOOKUP(K66,Projekte!C:D,2,FALSE))","v":""}]
[null,null,null,"","",null,"","","","",null,null,null,"","","",{"$f":"IF(K67=\"\", \"\", VLOOKUP(K67,Projekte!C:D,2,FALSE))","v":""}]
[null,null,null,{"$f":"IF(C68=\"\", \"\", C68-B68)","v":""},{"$f":"IF(D68=\"\", \"\", (C68-B68)*24)","v":""},null,{"$f":"IF(K68 = selectThisProjekt,E68, \"\")","v":""},"","","",null,null,null,"","","",{"$f":"IF(K68=\"\", \"\", VLOOKUP(K68,Projekte!C:D,2,FALSE))","v":""}]
[null,null,null,"","",null,"",{"$f":"IF(F69 = \"\", G69, \"\")","v":""},{"$f":"IF(LOWER(F69) = \"r\",G69,\"\")","v":""},{"$f":"IF(AND(F69<>\"\", LOWER(F69) <> \"r\"),G69,\"\")","v":""},null,null,null,"","","",{"$f":"IF(K69=\"\", \"\", VLOOKUP(K69,Projekte!C:D,2,FALSE))","v":""}]
[null,null,null,"","",null,"","","","",null,null,null,{"$f":"IF(M70<>\"\", \"\", IF(F70 = \"\", G70, \"\"))","v":""},{"$f":"IF(M70<>\"\", \"\", IF(LOWER(F70) = \"r\",G70,\"\"))","v":""},{"$f":"IF(M70<>\"\", \"\", IF(AND(F70<>\"\", LOWER(F70) <> \"r\"),G70,\"\"))","v":""},{"$f":"IF(K70=\"\", \"\", VLOOKUP(K70,Projekte!C:D,2,FALSE))","v":""}]
[null,null,null,"","",null,"","","","",null,null,null,"","","",{"$f":"IF(K71=\"\", \"\", VLOOKUP(K71,Projekte!C:D,2,FALSE))","v":""}]
[null,null,null,"","",null,"","","","",null,null,null,"","","",{"$f":"IF(K72=\"\", \"\", VLOOKUP(K72,Projekte!C:D,2,FALSE))","v":""}]
[null,null,null,"","",null,"","","","",null,null,null,"","","",{"$f":"IF(K73=\"\", \"\", VLOOKUP(K73,Projekte!C:D,2,FALSE))","v":""}]
[null,null,null,"","",null,"","","","",null,null,null,"","","",{"$f":"IF(K74=\"\", \"\", VLOOKUP(K74,Projekte!C:D,2,FALSE))","v":""}]
[null,null,null,"","",null,"","","","",null,null,null,"","","",{"$f":"IF(K75=\"\", \"\", VLOOKUP(K75,Projekte!C:D,2,FALSE))","v":""}]
[null,null,null,"","",null,"","","","",null,null,null,"","","",{"$f":"IF(K76=\"\", \"\", VLOOKUP(K76,Projekte!C:D,2,FALSE))","v":""}]
[null,null,null,"","",null,"","","","",null,null,null,"","","",{"$f":"IF(K77=\"\", \"\", VLOOKUP(K77,Projekte!C:D,2,FALSE))","v":""}]
[null,null,null,"","",null,"","","","",null,null,null,"","","",{"$f":"IF(K78=\"\", \"\", VLOOKUP(K78,Projekte!C:D,2,FALSE))","v":""}]
[null,null,null,"","",null,"","","","",null,null,null,"","","",{"$f":"IF(K79=\"\", \"\", VLOOKUP(K79,Projekte!C:D,2,FALSE))","v":""}]
[null,null,null,"","",null,"","","","",null,null,null,"","","",{"$f":"IF(K80=\"\", \"\", VLOOKUP(K80,Projekte!C:D,2,FALSE))","v":""}]
[null,null,null,"","",null,"","","","",null,null,null,"","","",{"$f":"IF(K81=\"\", \"\", VLOOKUP(K81,Projekte!C:D,2,FALSE))","v":""}]
[null,null,null,"","",null,"","","","",null,null,null,"","","",{"$f":"IF(K82=\"\", \"\", VLOOKUP(K82,Projekte!C:D,2,FALSE))","v":""}]
[null,null,null,"","",null,"","","","",null,null,null,"","","",{"$f":"IF(K83=\"\", \"\", VLOOKUP(K83,Projekte!C:D,2,FALSE))","v":""}]
[null,null,null,"","",null,"","","","",null,null,null,"","","",{"$f":"IF(K84=\"\", \"\", VLOOKUP(K84,Projekte!C:D,2,FALSE))","v":""}]
[null,null,null,"","",null,"","","","",null,null,null,"","","",{"$f":"IF(K85=\"\", \"\", VLOOKUP(K85,Projekte!C:D,2,FALSE))","v":""}]
[null,null,null,"","",null,"","","","",null,null,null,"","","",{"$f":"IF(K86=\"\", \"\", VLOOKUP(K86,Projekte!C:D,2,FALSE))","v":""}]
[null,null,null,"","",null,"","","","",null,null,null,"","","",{"$f":"IF(K87=\"\", \"\", VLOOKUP(K87,Projekte!C:D,2,FALSE))","v":""}]
[null,null,null,"","",null,"","","","",null,null,null,"","","",{"$f":"IF(K88=\"\", \"\", VLOOKUP(K88,Projekte!C:D,2,FALSE))","v":""}]
[null,null,null,"","",null,"","","","",null,null,null,"","","",{"$f":"IF(K89=\"\", \"\", VLOOKUP(K89,Projekte!C:D,2,FALSE))","v":""}]
[null,null,null,"","",null,"","","","",null,null,null,"","","",{"$f":"IF(K90=\"\", \"\", VLOOKUP(K90,Projekte!C:D,2,FALSE))","v":""}]
[null,null,null,"","",null,"","","","",null,null,null,"","","",{"$f":"IF(K91=\"\", \"\", VLOOKUP(K91,Projekte!C:D,2,FALSE))","v":""}]
[null,null,null,"","",null,"","","","",null,null,null,"","","",{"$f":"IF(K92=\"\", \"\", VLOOKUP(K92,Projekte!C:D,2,FALSE))","v":""}]
[null,null,null,"","",null,"","","","",null,null,null,"","","",{"$f":"IF(K93=\"\", \"\", VLOOKUP(K93,Projekte!C:D,2,FALSE))","v":""}]
[null,null,null,"","",null,"","","","",null,null,null,"","","",{"$f":"IF(K94=\"\", \"\", VLOOKUP(K94,Projekte!C:D,2,FALSE))","v":""}]
[null,null,null,"","",null,"","","","",null,null,null,"","","",{"$f":"IF(K95=\"\", \"\", VLOOKUP(K95,Projekte!C:D,2,FALSE))","v":""}]
[null,null,null,"","",null,"","","","",null,null,null,"","","",{"$f":"IF(K96=\"\", \"\", VLOOKUP(K96,Projekte!C:D,2,FALSE))","v":""}]
[null,null,null,"","",null,"","","","",null,null,null,"","","",{"$f":"IF(K97=\"\", \"\", VLOOKUP(K97,Projekte!C:D,2,FALSE))","v":""}]
[null,null,null,"","",null,"","","","",null,null,null,"","","",{"$f":"IF(K98=\"\", \"\", VLOOKUP(K98,Projekte!C:D,2,FALSE))","v":""}]
[null,null,null,"","",null,"","","","",null,null,null,"","","",{"$f":"IF(K99=\"\", \"\", VLOOKUP(K99,Projekte!C:D,2,FALSE))","v":""}]
[null,null,null,"","",null,{"$f":"IF(K100 = selectThisProjekt,E100, \"\")","v":""},"","","",null,null,null,"","","",{"$f":"IF(K100=\"\", \"\", VLOOKUP(K100,Projekte!C:D,2,FALSE))","v":""}]
[null,null,null,"","",null,"","","","",null,null,null,"","","",{"$f":"IF(K101=\"\", \"\", VLOOKUP(K101,Projekte!C:D,2,FALSE))","v":""}]
[null,null,null,"","",null,"","","","",null,null,null,"","","",{"$f":"IF(K102=\"\", \"\", VLOOKUP(K102,Projekte!C:D,2,FALSE))","v":""}]
[null,null,null,"","",null,"","","","",null,null,null,"","","",{"$f":"IF(K103=\"\", \"\", VLOOKUP(K103,Projekte!C:D,2,FALSE))","v":""}]
[null,null,null,"","",null,"","","","",null,null,null,"","","",{"$f":"IF(K104=\"\", \"\", VLOOKUP(K104,Projekte!C:D,2,FALSE))","v":""}]
[null,null,null,"","",null,"","","","",null,null,null,"","","",{"$f":"IF(K105=\"\", \"\", VLOOKUP(K105,Projekte!C:D,2,FALSE))","v":""}]
[null,null,null,"","",null,"","","","",null,null,null,"","","",{"$f":"IF(K106=\"\", \"\", VLOOKUP(K106,Projekte!C:D,2,FALSE))","v":""}]
[null,null,null,"","",null,"","","","",null,null,null,"","","",{"$f":"IF(K107=\"\", \"\", VLOOKUP(K107,Projekte!C:D,2,FALSE))","v":""}]
[null,null,null,"","",null,"","","","",null,null,null,"","","",{"$f":"IF(K108=\"\", \"\", VLOOKUP(K108,Projekte!C:D,2,FALSE))","v":""}]
[null,null,null,"","",null,"","","","",null,null,null,"","","",{"$f":"IF(K109=\"\", \"\", VLOOKUP(K109,Projekte!C:D,2,FALSE))","v":""}]
[null,null,null,"","",null,"","","","",null,null,null,"","","",{"$f":"IF(K110=\"\", \"\", VLOOKUP(K110,Projekte!C:D,2,FALSE))","v":""}]
[null,null,null,"","",null,"","","","",null,null,null,"","","",{"$f":"IF(K111=\"\", \"\", VLOOKUP(K111,Projekte!C:D,2,FALSE))","v":""}]
[null,null,null,"","",null,"","","","",null,null,null,"","","",{"$f":"IF(K112=\"\", \"\", VLOOKUP(K112,Projekte!C:D,2,FALSE))","v":""}]
[null,null,null,"","",null,"","","","",null,null,null,"","","",{"$f":"IF(K113=\"\", \"\", VLOOKUP(K113,Projekte!C:D,2,FALSE))","v":""}]
[null,null,null,"","",null,"","","","",null,null,null,"","","",{"$f":"IF(K114=\"\", \"\", VLOOKUP(K114,Projekte!C:D,2,FALSE))","v":""}]
[null,null,null,"","",null,"","","","",null,null,null,"","","",{"$f":"IF(K115=\"\", \"\", VLOOKUP(K115,Projekte!C:D,2,FALSE))","v":""}]
[null,null,null,"","",null,"","","","",null,null,null,"","","",{"$f":"IF(K116=\"\", \"\", VLOOKUP(K116,Projekte!C:D,2,FALSE))","v":""}]
[null,null,null,"","",null,"","","","",null,null,null,"","","",{"$f":"IF(K117=\"\", \"\", VLOOKUP(K117,Projekte!C:D,2,FALSE))","v":""}]
[null,null,null,"","",null,"","","","",null,null,null,"","","",{"$f":"IF(K118=\"\", \"\", VLOOKUP(K118,Projekte!C:D,2,FALSE))","v":""}]
[null,null,null,"","",null,"","","","",null,null,null,"","","",{"$f":"IF(K119=\"\", \"\", VLOOKUP(K119,Projekte!C:D,2,FALSE))","v":""}]
[null,null,null,"","",null,"","","","",null,null,null,"","","",{"$f":"IF(K120=\"\", \"\", VLOOKUP(K120,Projekte!C:D,2,FALSE))","v":""}]
[null,null,null,"","",null,"","","","",null,null,null,"","","",{"$f":"IF(K121=\"\", \"\", VLOOKUP(K121,Projekte!C:D,2,FALSE))","v":""}]
[null,null,null,"","",null,"","","","",null,null,null,"","","",{"$f":"IF(K122=\"\", \"\", VLOOKUP(K122,Projekte!C:D,2,FALSE))","v":""}]
[null,null,null,"","",null,{"$f":"IF(K123 = selectThisProjekt,E123, \"\")","v":""},"","","",null,null,null,"","","",{"$f":"IF(K123=\"\", \"\", VLOOKUP(K123,Projekte!C:D,2,FALSE))","v":""}]
[null,null,null,"","",null,"","","","",null,null,null,"","","",{"$f":"IF(K124=\"\", \"\", VLOOKUP(K124,Projekte!C:D,2,FALSE))","v":""}]
[null,null,null,"","",null,{"$f":"IF(K125 = selectThisProjekt,E125, \"\")","v":""},"","","",null,null,null,"","","",{"$f":"IF(K125=\"\", \"\", VLOOKUP(K125,Projekte!C:D,2,FALSE))","v":""}]
[null,null,null,"","",null,"","","","",null,null,null,"","","",{"$f":"IF(K126=\"\", \"\", VLOOKUP(K126,Projekte!C:D,2,FALSE))","v":""}]
[null,null,null,"","",null,"","","","",null,null,null,"","","",{"$f":"IF(K127=\"\", \"\", VLOOKUP(K127,Projekte!C:D,2,FALSE))","v":""}]
[null,null,null,"","",null,"","","","",null,null,null,"","","",{"$f":"IF(K128=\"\", \"\", VLOOKUP(K128,Projekte!C:D,2,FALSE))","v":""}]
[null,null,null,"","",null,"","","","",null,null,null,"","","",{"$f":"IF(K129=\"\", \"\", VLOOKUP(K129,Projekte!C:D,2,FALSE))","v":""}]
[null,null,null,"","",null,"","","","",null,null,null,"","","",{"$f":"IF(K130=\"\", \"\", VLOOKUP(K130,Projekte!C:D,2,FALSE))","v":""}]
[null,null,null,"","",null,"","","","",null,null,null,"","","",{"$f":"IF(K131=\"\", \"\", VLOOKUP(K131,Projekte!C:D,2,FALSE))","v":""}]
[null,null,null,{"$f":"IF(C132=\"\", \"\", C132-B132)","v":""},{"$f":"IF(D132=\"\", \"\", (C132-B132)*24)","v":""},null,{"$f":"IF(K132 = selectThisProjekt,E132, \"\")","v":""},"","","",null,null,null,"","","",{"$f":"IF(K132=\"\", \"\", VLOOKUP(K132,Projekte!C:D,2,FALSE))","v":""}]
[null,null,null,"","",null,"",{"$f":"IF(F133 = \"\", G133, \"\")","v":""},{"$f":"IF(LOWER(F133) = \"r\",G133,\"\")","v":""},{"$f":"IF(AND(F133<>\"\", LOWER(F133) <> \"r\"),G133,\"\")","v":""},null,null,null,"","","",{"$f":"IF(K133=\"\", \"\", VLOOKUP(K133,Projekte!C:D,2,FALSE))","v":""}]
[null,null,null,"","",null,"","","","",null,null,null,{"$f":"IF(M134<>\"\", \"\", IF(F134 = \"\", G134, \"\"))","v":""},{"$f":"IF(M134<>\"\", \"\", IF(LOWER(F134) = \"r\",G134,\"\"))","v":""},{"$f":"IF(M134<>\"\", \"\", IF(AND(F134<>\"\", LOWER(F134) <> \"r\"),G134,\"\"))","v":""},{"$f":"IF(K134=\"\", \"\", VLOOKUP(K134,Projekte!C:D,2,FALSE))","v":""}]
[null,null,null,"","",null,"","","","",null,null,null,"","","",{"$f":"IF(K135=\"\", \"\", VLOOKUP(K135,Projekte!C:D,2,FALSE))","v":""}]
[null,null,null,"","",null,"","","","",null,null,null,"","","",{"$f":"IF(K136=\"\", \"\", VLOOKUP(K136,Projekte!C:D,2,FALSE))","v":""}]
[null,null,null,"","",null,"","","","",null,null,null,"","","",{"$f":"IF(K137=\"\", \"\", VLOOKUP(K137,Projekte!C:D,2,FALSE))","v":""}]
[null,null,null,"","",null,"","","","",null,null,null,"","","",{"$f":"IF(K138=\"\", \"\", VLOOKUP(K138,Projekte!C:D,2,FALSE))","v":""}]
[null,null,null,"","",null,"","","","",null,null,null,"","","",{"$f":"IF(K139=\"\", \"\", VLOOKUP(K139,Projekte!C:D,2,FALSE))","v":""}]
[null,null,null,"","",null,"","","","",null,null,null,"","","",{"$f":"IF(K140=\"\", \"\", VLOOKUP(K140,Projekte!C:D,2,FALSE))","v":""}]
[null,null,null,"","",null,"","","","",null,null,null,"","","",{"$f":"IF(K141=\"\", \"\", VLOOKUP(K141,Projekte!C:D,2,FALSE))","v":""}]
[null,null,null,"","",null,"","","","",null,null,null,"","","",{"$f":"IF(K142=\"\", \"\", VLOOKUP(K142,Projekte!C:D,2,FALSE))","v":""}]
[null,null,null,"","",null,"","","","",null,null,null,"","","",{"$f":"IF(K143=\"\", \"\", VLOOKUP(K143,Projekte!C:D,2,FALSE))","v":""}]
[null,null,null,"","",null,"","","","",null,null,null,"","","",{"$f":"IF(K144=\"\", \"\", VLOOKUP(K144,Projekte!C:D,2,FALSE))","v":""}]
[null,null,null,"","",null,"","","","",null,null,null,"","","",{"$f":"IF(K145=\"\", \"\", VLOOKUP(K145,Projekte!C:D,2,FALSE))","v":""}]
[null,null,null,"","",null,"","","","",null,null,null,"","","",{"$f":"IF(K146=\"\", \"\", VLOOKUP(K146,Projekte!C:D,2,FALSE))","v":""}]
[null,null,null,"","",null,"","","","",null,null,null,"","","",{"$f":"IF(K147=\"\", \"\", VLOOKUP(K147,Projekte!C:D,2,FALSE))","v":""}]
[null,null,null,"","",null,"","","","",null,null,null,"","","",{"$f":"IF(K148=\"\", \"\", VLOOKUP(K148,Projekte!C:D,2,FALSE))","v":""}]
[null,null,null,"","",null,"","","","",null,null,null,"","","",{"$f":"IF(K149=\"\", \"\", VLOOKUP(K149,Projekte!C:D,2,FALSE))","v":""}]
[null,null,null,"","",null,"","","","",null,null,null,"","","",{"$f":"IF(K150=\"\", \"\", VLOOKUP(K150,Projekte!C:D,2,FALSE))","v":""}]
[null,null,null,"","",null,"","","","",null,null,null,"","","",{"$f":"IF(K151=\"\", \"\", VLOOKUP(K151,Projekte!C:D,2,FALSE))","v":""}]
[null,null,null,"","",null,"","","","",null,null,null,"","","",{"$f":"IF(K152=\"\", \"\", VLOOKUP(K152,Projekte!C:D,2,FALSE))","v":""}]
[null,null,null,"","",null,"","","","",null,null,null,"","","",{"$f":"IF(K153=\"\", \"\", VLOOKUP(K153,Projekte!C:D,2,FALSE))","v":""}]
[null,null,null,"","",null,"","","","",null,null,null,"","","",{"$f":"IF(K154=\"\", \"\", VLOOKUP(K154,Projekte!C:D,2,FALSE))","v":""}]
[null,null,null,"","",null,"","","","",null,null,null,"","","",{"$f":"IF(K155=\"\", \"\", VLOOKUP(K155,Projekte!C:D,2,FALSE))","v":""}]
[null,null,null,"","",null,"","","","",null,null,null,"","","",{"$f":"IF(K156=\"\", \"\", VLOOKUP(K156,Projekte!C:D,2,FALSE))","v":""}]
[null,null,null,"","",null,"","","","",null,null,null,"","","",{"$f":"IF(K157=\"\", \"\", VLOOKUP(K157,Projekte!C:D,2,FALSE))","v":""}]
[null,null,null,"","",null,"","","","",null,null,null,"","","",{"$f":"IF(K158=\"\", \"\", VLOOKUP(K158,Projekte!C:D,2,FALSE))","v":""}]
[null,null,null,"","",null,"","","","",null,null,null,"","","",{"$f":"IF(K159=\"\", \"\", VLOOKUP(K159,Projekte!C:D,2,FALSE))","v":""}]
[null,null,null,"","",null,"","","","",null,null,null,"","","",{"$f":"IF(K160=\"\", \"\", VLOOKUP(K160,Projekte!C:D,2,FALSE))","v":""}]
[null,null,null,"","",null,"","","","",null,null,null,"","","",{"$f":"IF(K161=\"\", \"\", VLOOKUP(K161,Projekte!C:D,2,FALSE))","v":""}]
[null,null,null,"","",null,"","","","",null,null,null,"","","",{"$f":"IF(K162=\"\", \"\", VLOOKUP(K162,Projekte!C:D,2,FALSE))","v":""}]
[null,null,null,"","",null,"","","","",null,null,null,"","","",{"$f":"IF(K163=\"\", \"\", VLOOKUP(K163,Projekte!C:D,2,FALSE))","v":""}]
[null,null,null,"","",null,{"$f":"IF(K164 = selectThisProjekt,E164, \"\")","v":""},"","","",null,null,null,"","","",{"$f":"IF(K164=\"\", \"\", VLOOKUP(K164,Projekte!C:D,2,FALSE))","v":""}]
[null,null,null,"","",null,"","","","",null,null,null,"","","",{"$f":"IF(K165=\"\", \"\", VLOOKUP(K165,Projekte!C:D,2,FALSE))","v":""}]
[null,null,null,"","",null,"","","","",null,null,null,"","","",{"$f":"IF(K166=\"\", \"\", VLOOKUP(K166,Projekte!C:D,2,FALSE))","v":""}]
[null,null,null,"","",null,"","","","",null,null,null,"","","",{"$f":"IF(K167=\"\", \"\", VLOOKUP(K167,Projekte!C:D,2,FALSE))","v":""}]
[null,null,null,"","",null,"","","","",null,null,null,"","","",{"$f":"IF(K168=\"\", \"\", VLOOKUP(K168,Projekte!C:D,2,FALSE))","v":""}]
[null,null,null,"","",null,"","","","",null,null,null,"","","",{"$f":"IF(K169=\"\", \"\", VLOOKUP(K169,Projekte!C:D,2,FALSE))","v":""}]
[null,null,null,"","",null,{"$f":"IF(K170 = selectThisProjekt,E170, \"\")","v":""},"","","",null,null,null,"","","",{"$f":"IF(K170=\"\", \"\", VLOOKUP(K170,Projekte!C:D,2,FALSE))","v":""}]
[null,null,null,"","",null,"","","","",null,null,null,"","","",{"$f":"IF(K171=\"\", \"\", VLOOKUP(K171,Projekte!C:D,2,FALSE))","v":""}]
[null,null,null,"","",null,"","","","",null,null,null,"","","",{"$f":"IF(K172=\"\", \"\", VLOOKUP(K172,Projekte!C:D,2,FALSE))","v":""}]
[null,null,null,"","",null,"","","","",null,null,null,"","","",{"$f":"IF(K173=\"\", \"\", VLOOKUP(K173,Projekte!C:D,2,FALSE))","v":""}]
[null,null,null,"","",null,"","","","",null,null,null,"","","",{"$f":"IF(K174=\"\", \"\", VLOOKUP(K174,Projekte!C:D,2,FALSE))","v":""}]
[null,null,null,"","",null,"","","","",null,null,null,"","","",{"$f":"IF(K175=\"\", \"\", VLOOKUP(K175,Projekte!C:D,2,FALSE))","v":""}]
[null,null,null,"","",null,"","","","",null,null,null,"","","",{"$f":"IF(K176=\"\", \"\", VLOOKUP(K176,Projekte!C:D,2,FALSE))","v":""}]
[null,null,null,"","",null,"","","","",null,null,null,"","","",{"$f":"IF(K177=\"\", \"\", VLOOKUP(K177,Projekte!C:D,2,FALSE))","v":""}]
[null,null,null,"","",null,"","","","",null,null,null,"","","",{"$f":"IF(K178=\"\", \"\", VLOOKUP(K178,Projekte!C:D,2,FALSE))","v":""}]
[null,null,null,"","",null,"","","","",null,null,null,"","","",{"$f":"IF(K179=\"\", \"\", VLOOKUP(K179,Projekte!C:D,2,FALSE))","v":""}]
[null,null,null,"","",null,"","","","",null,null,null,"","","",{"$f":"IF(K180=\"\", \"\", VLOOKUP(K180,Projekte!C:D,2,FALSE))","v":""}]
[null,null,null,"","",null,"","","","",null,null,null,"","","",{"$f":"IF(K181=\"\", \"\", VLOOKUP(K181,Projekte!C:D,2,FALSE))","v":""}]
[null,null,null,"","",null,"","","","",null,null,null,"","","",{"$f":"IF(K182=\"\", \"\", VLOOKUP(K182,Projekte!C:D,2,FALSE))","v":""}]
[null,null,null,"","",null,"","","","",null,null,null,"","","",{"$f":"IF(K183=\"\", \"\", VLOOKUP(K183,Projekte!C:D,2,FALSE))","v":""}]
[null,null,null,"","",null,"","","","",null,null,null,"","","",{"$f":"IF(K184=\"\", \"\", VLOOKUP(K184,Projekte!C:D,2,FALSE))","v":""}]
[null,null,null,"","",null,"","","","",null,null,null,"","","",{"$f":"IF(K185=\"\", \"\", VLOOKUP(K185,Projekte!C:D,2,FALSE))","v":""}]
[null,null,null,"","",null,"","","","",null,null,null,"","","",{"$f":"IF(K186=\"\", \"\", VLOOKUP(K186,Projekte!C:D,2,FALSE))","v":""}]
[null,null,null,"","",null,"","","","",null,null,null,"","","",{"$f":"IF(K187=\"\", \"\", VLOOKUP(K187,Projekte!C:D,2,FALSE))","v":""}]
[null,null,null,"","",null,"","","","",null,null,null,"","","",{"$f":"IF(K188=\"\", \"\", VLOOKUP(K188,Projekte!C:D,2,FALSE))","v":""}]
[null,null,null,"","",null,"","","","",null,null,null,"","","",{"$f":"IF(K189=\"\", \"\", VLOOKUP(K189,Projekte!C:D,2,FALSE))","v":""}]
[null,null,null,"","",null,"","","","",null,null,null,"","","",{"$f":"IF(K190=\"\", \"\", VLOOKUP(K190,Projekte!C:D,2,FALSE))","v":""}]
[null,null,null,"","",null,"","","","",null,null,null,"","","",{"$f":"IF(K191=\"\", \"\", VLOOKUP(K191,Projekte!C:D,2,FALSE))","v":""}]
[null,null,null,"","",null,"","","","",null,null,null,"","","",{"$f":"IF(K192=\"\", \"\", VLOOKUP(K192,Projekte!C:D,2,FALSE))","v":""}]
[null,null,null,"","",null,"","","","",null,null,null,"","","",{"$f":"IF(K193=\"\", \"\", VLOOKUP(K193,Projekte!C:D,2,FALSE))","v":""}]
[null,null,null,"","",null,"","","","",null,null,null,"","","",{"$f":"IF(K194=\"\", \"\", VLOOKUP(K194,Projekte!C:D,2,FALSE))","v":""}]
[null,null,null,"","",null,"","","","",null,null,null,"","","",{"$f":"IF(K195=\"\", \"\", VLOOKUP(K195,Projekte!C:D,2,FALSE))","v":""}]
[null,null,null,"","",null,"","","","",null,null,null,"","","",{"$f":"IF(K196=\"\", \"\", VLOOKUP(K196,Projekte!C:D,2,FALSE))","v":""}]
[null,null,null,"","",null,"","","","",null,null,null,"","","",{"$f":"IF(K197=\"\", \"\", VLOOKUP(K197,Projekte!C:D,2,FALSE))","v":""}]
[null,null,null,"","",null,"","","","",null,null,null,{"$f":"IF(M198<>\"\", \"\", IF(F198 = \"\", G198, \"\"))","v":""},{"$f":"IF(M198<>\"\", \"\", IF(LOWER(F198) = \"r\",G198,\"\"))","v":""},{"$f":"IF(M198<>\"\", \"\", IF(AND(F198<>\"\", LOWER(F198) <> \"r\"),G198,\"\"))","v":""},{"$f":"IF(K198=\"\", \"\", VLOOKUP(K198,Projekte!C:D,2,FALSE))","v":""}]
[null,null,null,"","",null,"","","","",null,null,null,"","","",{"$f":"IF(K199=\"\", \"\", VLOOKUP(K199,Projekte!C:D,2,FALSE))","v":""}]
[null,null,null,"","",null,"","","","",null,null,null,"","","",{"$f":"IF(K200=\"\", \"\", VLOOKUP(K200,Projekte!C:D,2,FALSE))","v":""}]
[null,null,null,"","",null,"","","","",null,null,null,"","","",{"$f":"IF(K201=\"\", \"\", VLOOKUP(K201,Projekte!C:D,2,FALSE))","v":""}]
[null,null,null,{"$f":"IF(C202=\"\", \"\", C202-B202)","v":""},{"$f":"IF(D202=\"\", \"\", (C202-B202)*24)","v":""},null,{"$f":"IF(K202 = selectThisProjekt,E202, \"\")","v":""},{"$f":"IF(F202 = \"\", G202, \"\")","v":""},{"$f":"IF(LOWER(F202) = \"r\",G202,\"\")","v":""},{"$f":"IF(AND(F202<>\"\", LOWER(F202) <> \"r\"),G202,\"\")","v":""},null,null,null,"","","",{"$f":"IF(K202=\"\", \"\", VLOOKUP(K202,Projekte!C:D,2,FALSE))","v":""}]
[null,null,null,{"$f":"IF(C203=\"\", \"\", C203-B203)","v":""},{"$f":"IF(D203=\"\", \"\", (C203-B203)*24)","v":""},null,{"$f":"IF(K203 = selectThisProjekt,E203, \"\")","v":""},{"$f":"IF(F203 = \"\", G203, \"\")","v":""},{"$f":"IF(LOWER(F203) = \"r\",G203,\"\")","v":""},{"$f":"IF(AND(F203<>\"\", LOWER(F203) <> \"r\"),G203,\"\")","v":""},null,null,null,"","","",{"$f":"IF(K203=\"\", \"\", VLOOKUP(K203,Projekte!C:D,2,FALSE))","v":""}]
["2018-08-31","13:00:00","13:31:00",{"$f":"IF(C204=\"\", \"\", C204-B204)","v":"00:31:00"},{"$f":"IF(D204=\"\", \"\", (C204-B204)*24)","v":0.5166666666666675},null,{"$f":"IF(K204 = selectThisProjekt,E204, \"\")","v":""},{"$f":"IF(F204 = \"\", G204, \"\")","v":""},{"$f":"IF(LOWER(F204) = \"r\",G204,\"\")","v":""},{"$f":"IF(AND(F204<>\"\", LOWER(F204) <> \"r\"),G204,\"\")","v":""},"BMA2023-TSMReorg","tel. Abstimmuugn mit Hr. Hinrichs\n+ Nachverfolgungen","2018-08-31T17:14:23","","","",{"$f":"IF(K204=\"\", \"\", VLOOKUP(K204,Projekte!C:D,2,FALSE))","v":{"$error":"#N/A"}}]
["2018-08-31","13:30:00","15:00:00",{"$f":"IF(C205=\"\", \"\", C205-B205)","v":"01:30:00"},{"$f":"IF(D205=\"\", \"\", (C205-B205)*24)","v":1.5},null,{"$f":"IF(K205 = selectThisProjekt,E205, \"\")","v":""},{"$f":"IF(F205 = \"\", G205, \"\")","v":""},{"$f":"IF(LOWER(F205) = \"r\",G205,\"\")","v":""},{"$f":"IF(AND(F205<>\"\", LOWER(F205) <> \"r\"),G205,\"\")","v":""},"AirPlusWebUpgrade","Tracking mit Hr. Novak\n+ Nachverfolgungen","2018-08-31T17:12:38",{"$f":"IF(M205<>\"\", \"\", IF(F205 = \"\", G205, \"\"))","v":""},{"$f":"IF(M205<>\"\", \"\", IF(LOWER(F205) = \"r\",G205,\"\"))","v":""},{"$f":"IF(M205<>\"\", \"\", IF(AND(F205<>\"\", LOWER(F205) <> \"r\"),G205,\"\"))","v":""},{"$f":"IF(K205=\"\", \"\", VLOOKUP(K205,Projekte!C:D,2,FALSE))","v":{"$error":"#N/A"}}]
["2018-08-31","14:52:00","17:21:00",{"$f":"IF(C206=\"\", \"\", C206-B206)","v":"02:29:00"},{"$f":"IF(D206=\"\", \"\", (C206-B206)*24)","v":2.4833333333333352},null,{"$f":"IF(K206 = selectThisProjekt,E206, \"\")","v":""},{"$f":"IF(F206 = \"\", G206, \"\")","v":""},{"$f":"IF(LOWER(F206) = \"r\",G206,\"\")","v":""},{"$f":"IF(AND(F206<>\"\", LOWER(F206) <> \"r\"),G206,\"\")","v":""},"orga2017","005 Routine\nAbstimmungnen mit T. Klages","2018-08-31T17:08:10",{"$f":"IF(M206<>\"\", \"\", IF(F206 = \"\", G206, \"\"))","v":""},{"$f":"IF(M206<>\"\", \"\", IF(LOWER(F206) = \"r\",G206,\"\"))","v":""},{"$f":"IF(M206<>\"\", \"\", IF(AND(F206<>\"\", LOWER(F206) <> \"r\"),G206,\"\"))","v":""},{"$f":"IF(K206=\"\", \"\", VLOOKUP(K206,Projekte!C:D,2,FALSE))","v":"CT - P20-0001/P17-0001/P19-0131 interne Consulting Tätigkeiten"}]
[null,null,null,"","",null,"","","","",null,null,null,"","","",{"$f":"IF(K207=\"\", \"\", VLOOKUP(K207,Projekte!C:D,2,FALSE))","v":""}]
[null,null,null,"","",null,"","","","",null,null,null,"","","",{"$f":"IF(K208=\"\", \"\", VLOOKUP(K208,Projekte!C:D,2,FALSE))","v":""}]
[null,null,null,"","",null,"","","","",null,null,null,"","","",{"$f":"IF(K209=\"\", \"\", VLOOKUP(K209,Projekte!C:D,2,FALSE))","v":""}]
[null,null,null,"","",null,"","","","",null,null,null,"","","",{"$f":"IF(K210=\"\", \"\", VLOOKUP(K210,Projekte!C:D,2,FALSE))","v":""}]
[null,null,null,"","",null,"","","","",null,null,null,"","","",{"$f":"IF(K211=\"\", \"\", VLOOKUP(K211,Projekte!C:D,2,FALSE))","v":""}]
[null,null,null,"","",null,"","","","",null,null,null,"","","",{"$f":"IF(K212=\"\", \"\", VLOOKUP(K212,Projekte!C:D,2,FALSE))","v":""}]
[null,null,null,"","",null,"","","","",null,null,null,"","","",{"$f":"IF(K213=\"\", \"\", VLOOKUP(K213,Projekte!C:D,2,FALSE))","v":""}]
[null,null,null,"","",null,"","","","",null,null,null,"","","",{"$f":"IF(K214=\"\", \"\", VLOOKUP(K214,Projekte!C:D,2,FALSE))","v":""}]
[null,null,null,"","",null,"","","","",null,null,null,"","","",{"$f":"IF(K215=\"\", \"\", VLOOKUP(K215,Projekte!C:D,2,FALSE))","v":""}]
[null,null,null,"","",null,"","","","",null,null,null,"","","",{"$f":"IF(K216=\"\", \"\", VLOOKUP(K216,Projekte!C:D,2,FALSE))","v":""}]
[null,null,null,"","",null,"","","","",null,null,null,"","","",{"$f":"IF(K217=\"\", \"\", VLOOKUP(K217,Projekte!C:D,2,FALSE))","v":""}]
[null,null,null,"","",null,"","","","",null,null,null,"","","",{"$f":"IF(K218=\"\", \"\", VLOOKUP(K218,Projekte!C:D,2,FALSE))","v":""}]
[null,null,null,"","",null,"","","","",null,null,null,"","","",{"$f":"IF(K219=\"\", \"\", VLOOKUP(K219,Projekte!C:D,2,FALSE))","v":""}]
[null,null,null,"","",null,"","","","",null,null,null,"","","",{"$f":"IF(K220=\"\", \"\", VLOOKUP(K220,Projekte!C:D,2,FALSE))","v":""}]
[null,null,null,"","",null,"","","","",null,null,null,"","","",{"$f":"IF(K221=\"\", \"\", VLOOKUP(K221,Projekte!C:D,2,FALSE))","v":""}]
[null,null,null,"","",null,"","","","",null,null,null,"","","",{"$f":"IF(K222=\"\", \"\", VLOOKUP(K222,Projekte!C:D,2,FALSE))","v":""}]
[null,null,null,"","",null,"","","","",null,null,null,"","","",{"$f":"IF(K223=\"\", \"\", VLOOKUP(K223,Projekte!C:D,2,FALSE))","v":""}]
[null,null,null,"","",null,"","","","",null,null,null,"","","",{"$f":"IF(K224=\"\", \"\", VLOOKUP(K224,Projekte!C:D,2,FALSE))","v":""}]
[null,null,null,"","",null,"","","","",null,null,null,"","","",{"$f":"IF(K225=\"\", \"\", VLOOKUP(K225,Projekte!C:D,2,FALSE))","v":""}]
[null,null,null,"","",null,"","","","",null,null,null,"","","",{"$f":"IF(K226=\"\", \"\", VLOOKUP(K226,Projekte!C:D,2,FALSE))","v":""}]
[null,null,null,"","",null,"","","","",null,null,null,"","","",{"$f":"IF(K227=\"\", \"\", VLOOKUP(K227,Projekte!C:D,2,FALSE))","v":""}]
[null,null,null,"","",null,"","","","",null,null,null,"","","",{"$f":"IF(K228=\"\", \"\", VLOOKUP(K228,Projekte!C:D,2,FALSE))","v":""}]
[null,null,null,"","",null,"","","","",null,null,null,"","","",{"$f":"IF(K229=\"\", \"\", VLOOKUP(K229,Projekte!C:D,2,FALSE))","v":""}]
[null,null,null,"","",null,"","","","",null,null,null,"","","",{"$f":"IF(K230=\"\", \"\", VLOOKUP(K230,Projekte!C:D,2,FALSE))","v":""}]
[null,null,null,"","",null,"","","","",null,null,null,"","","",{"$f":"IF(K231=\"\", \"\", VLOOKUP(K231,Projekte!C:D,2,FALSE))","v":""}]
[null,null,null,"","",null,"","","","",null,null,null,"","","",{"$f":"IF(K232=\"\", \"\", VLOOKUP(K232,Projekte!C:D,2,FALSE))","v":""}]
[null,null,null,"","",null,"","","","",null,null,null,"","","",{"$f":"IF(K233=\"\", \"\", VLOOKUP(K233,Projekte!C:D,2,FALSE))","v":""}]
[null,null,null,"","",null,"","","","",null,null,null,"","","",{"$f":"IF(K234=\"\", \"\", VLOOKUP(K234,Projekte!C:D,2,FALSE))","v":""}]
[null,null,null,"","",null,"","","","",null,null,null,"","","",{"$f":"IF(K235=\"\", \"\", VLOOKUP(K235,Projekte!C:D,2,FALSE))","v":""}]
[null,null,null,"","",null,"","","","",null,null,null,"","","",{"$f":"IF(K236=\"\", \"\", VLOOKUP(K236,Projekte!C:D,2,FALSE))","v":""}]
[null,null,null,"<Ende Formeln>"]

{"sheet":"Sep","index":9,"n_rows":204,"n_cols":17,"rows_kept":204,"cut":false,"hidden":false,"merged":[[0,13,0,15],[2,0,2,2]]}
[null,null,"DL-Zeiten von",{"$f":"AssignedToCfg","v":{"$error":"#REF!"}},null,null,null,null,null,null,null,null,null,"Faktura nicht erfasst"]
["Datum","Beginn","Ende","h","h,xx","r: Reise, \nx: nicht berechnen","Summe","Dienstleistung","Reise","nicht berechnen",null,"Tätigkeit","Faktura erfasst","Dienstleistung","Reise","nicht berechnen","Projektname"]
[null,null,null,null,null,"Summe",{"$f":"SUM(G4:G203)","v":0},{"$f":"SUM(H4:H203)","v":0},{"$f":"SUM(I4:I203)","v":0},{"$f":"SUM(J4:J203)","v":0},null,"<- für diesen ProjektBereich",null,{"$f":"SUM(N4:N203)","v":0},{"$f":"SUM(O4:O203)","v":0},{"$f":"SUM(P4:P203)","v":0}]
[null,null,null,{"$f":"IF(C4=\"\", \"\", C4-B4)","v":""},{"$f":"IF(D4=\"\", \"\", (C4-B4)*24)","v":""},null,{"$f":"IF(K4 = selectThisProjekt,E4, \"\")","v":""},{"$f":"IF(F4 = \"\", G4, \"\")","v":""},{"$f":"IF(LOWER(F4) = \"r\",G4,\"\")","v":""},{"$f":"IF(AND(F4<>\"\", LOWER(F4) <> \"r\"),G4,\"\")","v":""},null,null,null,{"$f":"IF(M4<>\"\", \"\", IF(F4 = \"\", G4, \"\"))","v":""},{"$f":"IF(M4<>\"\", \"\", IF(LOWER(F4) = \"r\",G4,\"\"))","v":""},{"$f":"IF(M4<>\"\", \"\", IF(AND(F4<>\"\", LOWER(F4) <> \"r\"),G4,\"\"))","v":""},{"$f":"IF(K4=\"\", \"\", VLOOKUP(K4,Projekte!C:D,2,FALSE))","v":""}]
[null,null,null,"","",null,"",{"$f":"IF(F5 = \"\", G5, \"\")","v":""},{"$f":"IF(LOWER(F5) = \"r\",G5,\"\")","v":""},{"$f":"IF(AND(F5<>\"\", LOWER(F5) <> \"r\"),G5,\"\")","v":""},null,null,null,{"$f":"IF(M5<>\"\", \"\", IF(F5 = \"\", G5, \"\"))","v":""},{"$f":"IF(M5<>\"\", \"\", IF(LOWER(F5) = \"r\",G5,\"\"))","v":""},{"$f":"IF(M5<>\"\", \"\", IF(AND(F5<>\"\", LOWER(F5) <> \"r\"),G5,\"\"))","v":""},{"$f":"IF(K5=\"\", \"\", VLOOKUP(K5,Projekte!C:D,2,FALSE))","v":""}]
[null,null,null,"","",null,"","","","",null,null,null,{"$f":"IF(M6<>\"\", \"\", IF(F6 = \"\", G6, \"\"))","v":""},{"$f":"IF(M6<>\"\", \"\", IF(LOWER(F6) = \"r\",G6,\"\"))","v":""},{"$f":"IF(M6<>\"\", \"\", IF(AND(F6<>\"\", LOWER(F6) <> \"r\"),G6,\"\"))","v":""},{"$f":"IF(K6=\"\", \"\", VLOOKUP(K6,Projekte!C:D,2,FALSE))","v":""}]
[null,null,null,"","",null,"","","","",null,null,null,"","","",{"$f":"IF(K7=\"\", \"\", VLOOKUP(K7,Projekte!C:D,2,FALSE))","v":""}]
[null,null,null,"","",null,"","","","",null,null,null,"","","",{"$f":"IF(K8=\"\", \"\", VLOOKUP(K8,Projekte!C:D,2,FALSE))","v":""}]
[null,null,null,"","",null,"","","","",null,null,null,"","","",{"$f":"IF(K9=\"\", \"\", VLOOKUP(K9,Projekte!C:D,2,FALSE))","v":""}]
[null,null,null,"","",null,"","","","",null,null,null,"","","",{"$f":"IF(K10=\"\", \"\", VLOOKUP(K10,Projekte!C:D,2,FALSE))","v":""}]
[null,null,null,"","",null,"","","","",null,null,null,"","","",{"$f":"IF(K11=\"\", \"\", VLOOKUP(K11,Projekte!C:D,2,FALSE))","v":""}]
[null,null,null,"","",null,"","","","",null,null,null,"","","",{"$f":"IF(K12=\"\", \"\", VLOOKUP(K12,Projekte!C:D,2,FALSE))","v":""}]
[null,null,null,"","",null,"","","","",null,null,null,"","","",{"$f":"IF(K13=\"\", \"\", VLOOKUP(K13,Projekte!C:D,2,FALSE))","v":""}]
[null,null,null,"","",null,"","","","",null,null,null,"","","",{"$f":"IF(K14=\"\", \"\", VLOOKUP(K14,Projekte!C:D,2,FALSE))","v":""}]
[null,null,null,"","",null,"","","","",null,null,null,"","","",{"$f":"IF(K15=\"\", \"\", VLOOKUP(K15,Projekte!C:D,2,FALSE))","v":""}]
[null,null,null,"","",null,"","","","",null,null,null,"","","",{"$f":"IF(K16=\"\", \"\", VLOOKUP(K16,Projekte!C:D,2,FALSE))","v":""}]
[null,null,null,"","",null,"","","","",null,null,null,"","","",{"$f":"IF(K17=\"\", \"\", VLOOKUP(K17,Projekte!C:D,2,FALSE))","v":""}]
[null,null,null,"","",null,"","","","",null,null,null,"","","",{"$f":"IF(K18=\"\", \"\", VLOOKUP(K18,Projekte!C:D,2,FALSE))","v":""}]
[null,null,null,"","",null,"","","","",null,null,null,"","","",{"$f":"IF(K19=\"\", \"\", VLOOKUP(K19,Projekte!C:D,2,FALSE))","v":""}]
[null,null,null,"","",null,"","","","",null,null,null,"","","",{"$f":"IF(K20=\"\", \"\", VLOOKUP(K20,Projekte!C:D,2,FALSE))","v":""}]
[null,null,null,"","",null,"","","","",null,null,null,"","","",{"$f":"IF(K21=\"\", \"\", VLOOKUP(K21,Projekte!C:D,2,FALSE))","v":""}]
[null,null,null,"","",null,"","","","",null,null,null,"","","",{"$f":"IF(K22=\"\", \"\", VLOOKUP(K22,Projekte!C:D,2,FALSE))","v":""}]
[null,null,null,"","",null,"","","","",null,null,null,"","","",{"$f":"IF(K23=\"\", \"\", VLOOKUP(K23,Projekte!C:D,2,FALSE))","v":""}]
[null,null,null,"","",null,"","","","",null,null,null,"","","",{"$f":"IF(K24=\"\", \"\", VLOOKUP(K24,Projekte!C:D,2,FALSE))","v":""}]
[null,null,null,"","",null,"","","","",null,null,null,"","","",{"$f":"IF(K25=\"\", \"\", VLOOKUP(K25,Projekte!C:D,2,FALSE))","v":""}]
[null,null,null,"","",null,"","","","",null,null,null,"","","",{"$f":"IF(K26=\"\", \"\", VLOOKUP(K26,Projekte!C:D,2,FALSE))","v":""}]
[null,null,null,"","",null,"","","","",null,null,null,"","","",{"$f":"IF(K27=\"\", \"\", VLOOKUP(K27,Projekte!C:D,2,FALSE))","v":""}]
[null,null,null,"","",null,"","","","",null,null,null,"","","",{"$f":"IF(K28=\"\", \"\", VLOOKUP(K28,Projekte!C:D,2,FALSE))","v":""}]
[null,null,null,"","",null,"","","","",null,null,null,"","","",{"$f":"IF(K29=\"\", \"\", VLOOKUP(K29,Projekte!C:D,2,FALSE))","v":""}]
[null,null,null,"","",null,"","","","",null,null,null,"","","",{"$f":"IF(K30=\"\", \"\", VLOOKUP(K30,Projekte!C:D,2,FALSE))","v":""}]
[null,null,null,"","",null,"","","","",null,null,null,"","","",{"$f":"IF(K31=\"\", \"\", VLOOKUP(K31,Projekte!C:D,2,FALSE))","v":""}]
[null,null,null,"","",null,"","","","",null,null,null,"","","",{"$f":"IF(K32=\"\", \"\", VLOOKUP(K32,Projekte!C:D,2,FALSE))","v":""}]
[null,null,null,"","",null,"","","","",null,null,null,"","","",{"$f":"IF(K33=\"\", \"\", VLOOKUP(K33,Projekte!C:D,2,FALSE))","v":""}]
[null,null,null,"","",null,"","","","",null,null,null,"","","",{"$f":"IF(K34=\"\", \"\", VLOOKUP(K34,Projekte!C:D,2,FALSE))","v":""}]
[null,null,null,"","",null,"","","","",null,null,null,"","","",{"$f":"IF(K35=\"\", \"\", VLOOKUP(K35,Projekte!C:D,2,FALSE))","v":""}]
[null,null,null,"","",null,{"$f":"IF(K36 = selectThisProjekt,E36, \"\")","v":""},"","","",null,null,null,"","","",{"$f":"IF(K36=\"\", \"\", VLOOKUP(K36,Projekte!C:D,2,FALSE))","v":""}]
[null,null,null,"","",null,"","","","",null,null,null,"","","",{"$f":"IF(K37=\"\", \"\", VLOOKUP(K37,Projekte!C:D,2,FALSE))","v":""}]
[null,null,null,"","",null,"","","","",null,null,null,"","","",{"$f":"IF(K38=\"\", \"\", VLOOKUP(K38,Projekte!C:D,2,FALSE))","v":""}]
[null,null,null,"","",null,"","","","",null,null,null,"","","",{"$f":"IF(K39=\"\", \"\", VLOOKUP(K39,Projekte!C:D,2,FALSE))","v":""}]
[null,null,null,"","",null,"","","","",null,null,null,"","","",{"$f":"IF(K40=\"\", \"\", VLOOKUP(K40,Projekte!C:D,2,FALSE))","v":""}]
[null,null,null,"","",null,"","","","",null,null,null,"","","",{"$f":"IF(K41=\"\", \"\", VLOOKUP(K41,Projekte!C:D,2,FALSE))","v":""}]
[null,null,null,"","",null,"","","","",null,null,null,"","","",{"$f":"IF(K42=\"\", \"\", VLOOKUP(K42,Projekte!C:D,2,FALSE))","v":""}]
[null,null,null,"","",null,"","","","",null,null,null,"","","",{"$f":"IF(K43=\"\", \"\", VLOOKUP(K43,Projekte!C:D,2,FALSE))","v":""}]
[null,null,null,"","",null,"","","","",null,null,null,"","","",{"$f":"IF(K44=\"\", \"\", VLOOKUP(K44,Projekte!C:D,2,FALSE))","v":""}]
[null,null,null,"","",null,"","","","",null,null,null,"","","",{"$f":"IF(K45=\"\", \"\", VLOOKUP(K45,Projekte!C:D,2,FALSE))","v":""}]
[null,null,null,"","",null,"","","","",null,null,null,"","","",{"$f":"IF(K46=\"\", \"\", VLOOKUP(K46,Projekte!C:D,2,FALSE))","v":""}]
[null,null,null,"","",null,"","","","",null,null,null,"","","",{"$f":"IF(K47=\"\", \"\", VLOOKUP(K47,Projekte!C:D,2,FALSE))","v":""}]
[null,null,null,"","",null,"","","","",null,null,null,"","","",{"$f":"IF(K48=\"\", \"\", VLOOKUP(K48,Projekte!C:D,2,FALSE))","v":""}]
[null,null,null,"","",null,"","","","",null,null,null,"","","",{"$f":"IF(K49=\"\", \"\", VLOOKUP(K49,Projekte!C:D,2,FALSE))","v":""}]
[null,null,null,"","",null,"","","","",null,null,null,"","","",{"$f":"IF(K50=\"\", \"\", VLOOKUP(K50,Projekte!C:D,2,FALSE))","v":""}]
[null,null,null,"","",null,"","","","",null,null,null,"","","",{"$f":"IF(K51=\"\", \"\", VLOOKUP(K51,Projekte!C:D,2,FALSE))","v":""}]
[null,null,null,"","",null,"","","","",null,null,null,"","","",{"$f":"IF(K52=\"\", \"\", VLOOKUP(K52,Projekte!C:D,2,FALSE))","v":""}]
[null,null,null,"","",null,"","","","",null,null,null,"","","",{"$f":"IF(K53=\"\", \"\", VLOOKUP(K53,Projekte!C:D,2,FALSE))","v":""}]
[null,null,null,"","",null,"","","","",null,null,null,"","","",{"$f":"IF(K54=\"\", \"\", VLOOKUP(K54,Projekte!C:D,2,FALSE))","v":""}]
[null,null,null,"","",null,"","","","",null,null,null,"","","",{"$f":"IF(K55=\"\", \"\", VLOOKUP(K55,Projekte!C:D,2,FALSE))","v":""}]
[null,null,null,"","",null,"","","","",null,null,null,"","","",{"$f":"IF(K56=\"\", \"\", VLOOKUP(K56,Projekte!C:D,2,FALSE))","v":""}]
[null,null,null,"","",null,"","","","",null,null,null,"","","",{"$f":"IF(K57=\"\", \"\", VLOOKUP(K57,Projekte!C:D,2,FALSE))","v":""}]
[null,null,null,"","",null,"","","","",null,null,null,"","","",{"$f":"IF(K58=\"\", \"\", VLOOKUP(K58,Projekte!C:D,2,FALSE))","v":""}]
[null,null,null,"","",null,"","","","",null,null,null,"","","",{"$f":"IF(K59=\"\", \"\", VLOOKUP(K59,Projekte!C:D,2,FALSE))","v":""}]
[null,null,null,"","",null,"","","","",null,null,null,"","","",{"$f":"IF(K60=\"\", \"\", VLOOKUP(K60,Projekte!C:D,2,FALSE))","v":""}]
[null,null,null,"","",null,"","","","",null,null,null,"","","",{"$f":"IF(K61=\"\", \"\", VLOOKUP(K61,Projekte!C:D,2,FALSE))","v":""}]
[null,null,null,"","",null,"","","","",null,null,null,"","","",{"$f":"IF(K62=\"\", \"\", VLOOKUP(K62,Projekte!C:D,2,FALSE))","v":""}]
[null,null,null,"","",null,"","","","",null,null,null,"","","",{"$f":"IF(K63=\"\", \"\", VLOOKUP(K63,Projekte!C:D,2,FALSE))","v":""}]
[null,null,null,"","",null,"","","","",null,null,null,"","","",{"$f":"IF(K64=\"\", \"\", VLOOKUP(K64,Projekte!C:D,2,FALSE))","v":""}]
[null,null,null,"","",null,"","","","",null,null,null,"","","",{"$f":"IF(K65=\"\", \"\", VLOOKUP(K65,Projekte!C:D,2,FALSE))","v":""}]
[null,null,null,"","",null,"","","","",null,null,null,"","","",{"$f":"IF(K66=\"\", \"\", VLOOKUP(K66,Projekte!C:D,2,FALSE))","v":""}]
[null,null,null,"","",null,"","","","",null,null,null,"","","",{"$f":"IF(K67=\"\", \"\", VLOOKUP(K67,Projekte!C:D,2,FALSE))","v":""}]
[null,null,null,{"$f":"IF(C68=\"\", \"\", C68-B68)","v":""},{"$f":"IF(D68=\"\", \"\", (C68-B68)*24)","v":""},null,{"$f":"IF(K68 = selectThisProjekt,E68, \"\")","v":""},"","","",null,null,null,"","","",{"$f":"IF(K68=\"\", \"\", VLOOKUP(K68,Projekte!C:D,2,FALSE))","v":""}]
[null,null,null,"","",null,"",{"$f":"IF(F69 = \"\", G69, \"\")","v":""},{"$f":"IF(LOWER(F69) = \"r\",G69,\"\")","v":""},{"$f":"IF(AND(F69<>\"\", LOWER(F69) <> \"r\"),G69,\"\")","v":""},null,null,null,"","","",{"$f":"IF(K69=\"\", \"\", VLOOKUP(K69,Projekte!C:D,2,FALSE))","v":""}]
[null,null,null,"","",null,"","","","",null,null,null,{"$f":"IF(M70<>\"\", \"\", IF(F70 = \"\", G70, \"\"))","v":""},{"$f":"IF(M70<>\"\", \"\", IF(LOWER(F70) = \"r\",G70,\"\"))","v":""},{"$f":"IF(M70<>\"\", \"\", IF(AND(F70<>\"\", LOWER(F70) <> \"r\"),G70,\"\"))","v":""},{"$f":"IF(K70=\"\", \"\", VLOOKUP(K70,Projekte!C:D,2,FALSE))","v":""}]
[null,null,null,"","",null,"","","","",null,null,null,"","","",{"$f":"IF(K71=\"\", \"\", VLOOKUP(K71,Projekte!C:D,2,FALSE))","v":""}]
[null,null,null,"","",null,"","","","",null,null,null,"","","",{"$f":"IF(K72=\"\", \"\", VLOOKUP(K72,Projekte!C:D,2,FALSE))","v":""}]
[null,null,null,"","",null,"","","","",null,null,null,"","","",{"$f":"IF(K73=\"\", \"\", VLOOKUP(K73,Projekte!C:D,2,FALSE))","v":""}]
[null,null,null,"","",null,"","","","",null,null,null,"","","",{"$f":"IF(K74=\"\", \"\", VLOOKUP(K74,Projekte!C:D,2,FALSE))","v":""}]
[null,null,null,"","",null,"","","","",null,null,null,"","","",{"$f":"IF(K75=\"\", \"\", VLOOKUP(K75,Projekte!C:D,2,FALSE))","v":""}]
[null,null,null,"","",null,"","","","",null,null,null,"","","",{"$f":"IF(K76=\"\", \"\", VLOOKUP(K76,Projekte!C:D,2,FALSE))","v":""}]
[null,null,null,"","",null,"","","","",null,null,null,"","","",{"$f":"IF(K77=\"\", \"\", VLOOKUP(K77,Projekte!C:D,2,FALSE))","v":""}]
[null,null,null,"","",null,"","","","",null,null,null,"","","",{"$f":"IF(K78=\"\", \"\", VLOOKUP(K78,Projekte!C:D,2,FALSE))","v":""}]
[null,null,null,"","",null,"","","","",null,null,null,"","","",{"$f":"IF(K79=\"\", \"\", VLOOKUP(K79,Projekte!C:D,2,FALSE))","v":""}]
[null,null,null,"","",null,"","","","",null,null,null,"","","",{"$f":"IF(K80=\"\", \"\", VLOOKUP(K80,Projekte!C:D,2,FALSE))","v":""}]
[null,null,null,"","",null,"","","","",null,null,null,"","","",{"$f":"IF(K81=\"\", \"\", VLOOKUP(K81,Projekte!C:D,2,FALSE))","v":""}]
[null,null,null,"","",null,"","","","",null,null,null,"","","",{"$f":"IF(K82=\"\", \"\", VLOOKUP(K82,Projekte!C:D,2,FALSE))","v":""}]
[null,null,null,"","",null,"","","","",null,null,null,"","","",{"$f":"IF(K83=\"\", \"\", VLOOKUP(K83,Projekte!C:D,2,FALSE))","v":""}]
[null,null,null,"","",null,"","","","",null,null,null,"","","",{"$f":"IF(K84=\"\", \"\", VLOOKUP(K84,Projekte!C:D,2,FALSE))","v":""}]
[null,null,null,"","",null,"","","","",null,null,null,"","","",{"$f":"IF(K85=\"\", \"\", VLOOKUP(K85,Projekte!C:D,2,FALSE))","v":""}]
[null,null,null,"","",null,"","","","",null,null,null,"","","",{"$f":"IF(K86=\"\", \"\", VLOOKUP(K86,Projekte!C:D,2,FALSE))","v":""}]
[null,null,null,"","",null,"","","","",null,null,null,"","","",{"$f":"IF(K87=\"\", \"\", VLOOKUP(K87,Projekte!C:D,2,FALSE))","v":""}]
[null,null,null,"","",null,"","","","",null,null,null,"","","",{"$f":"IF(K88=\"\", \"\", VLOOKUP(K88,Projekte!C:D,2,FALSE))","v":""}]
[null,null,null,"","",null,"","","","",null,null,null,"","","",{"$f":"IF(K89=\"\", \"\", VLOOKUP(K89,Projekte!C:D,2,FALSE))","v":""}]
[null,null,null,"","",null,"","","","",null,null,null,"","","",{"$f":"IF(K90=\"\", \"\", VLOOKUP(K90,Projekte!C:D,2,FALSE))","v":""}]
[null,null,null,"","",null,"","","","",null,null,null,"","","",{"$f":"IF(K91=\"\", \"\", VLOOKUP(K91,Projekte!C:D,2,FALSE))","v":""}]
[null,null,null,"","",null,"","","","",null,null,null,"","","",{"$f":"IF(K92=\"\", \"\", VLOOKUP(K92,Projekte!C:D,2,FALSE))","v":""}]
[null,null,null,"","",null,"","","","",null,null,null,"","","",{"$f":"IF(K93=\"\", \"\", VLOOKUP(K93,Projekte!C:D,2,FALSE))","v":""}]
[null,null,null,"","",null,"","","","",null,null,null,"","","",{"$f":"IF(K94=\"\", \"\", VLOOKUP(K94,Projekte!C:D,2,FALSE))","v":""}]
[null,null,null,"","",null,"","","","",null,null,null,"","","",{"$f":"IF(K95=\"\", \"\", VLOOKUP(K95,Projekte!C:D,2,FALSE))","v":""}]
[null,null,null,"","",null,"","","","",null,null,null,"","","",{"$f":"IF(K96=\"\", \"\", VLOOKUP(K96,Projekte!C:D,2,FALSE))","v":""}]
[null,null,null,"","",null,"","","","",null,null,null,"","","",{"$f":"IF(K97=\"\", \"\", VLOOKUP(K97,Projekte!C:D,2,FALSE))","v":""}]
[null,null,null,"","",null,"","","","",null,null,null,"","","",{"$f":"IF(K98=\"\", \"\", VLOOKUP(K98,Projekte!C:D,2,FALSE))","v":""}]
[null,null,null,"","",null,"","","","",null,null,null,"","","",{"$f":"IF(K99=\"\", \"\", VLOOKUP(K99,Projekte!C:D,2,FALSE))","v":""}]
[null,null,null,"","",null,{"$f":"IF(K100 = selectThisProjekt,E100, \"\")","v":""},"","","",null,null,null,"","","",{"$f":"IF(K100=\"\", \"\", VLOOKUP(K100,Projekte!C:D,2,FALSE))","v":""}]
[null,null,null,"","",null,"","","","",null,null,null,"","","",{"$f":"IF(K101=\"\", \"\", VLOOKUP(K101,Projekte!C:D,2,FALSE))","v":""}]
[null,null,null,"","",null,"","","","",null,null,null,"","","",{"$f":"IF(K102=\"\", \"\", VLOOKUP(K102,Projekte!C:D,2,FALSE))","v":""}]
[null,null,null,"","",null,"","","","",null,null,null,"","","",{"$f":"IF(K103=\"\", \"\", VLOOKUP(K103,Projekte!C:D,2,FALSE))","v":""}]
[null,null,null,"","",null,"","","","",null,null,null,"","","",{"$f":"IF(K104=\"\", \"\", VLOOKUP(K104,Projekte!C:D,2,FALSE))","v":""}]
[null,null,null,"","",null,"","","","",null,null,null,"","","",{"$f":"IF(K105=\"\", \"\", VLOOKUP(K105,Projekte!C:D,2,FALSE))","v":""}]
[null,null,null,"","",null,"","","","",null,null,null,"","","",{"$f":"IF(K106=\"\", \"\", VLOOKUP(K106,Projekte!C:D,2,FALSE))","v":""}]
[null,null,null,"","",null,"","","","",null,null,null,"","","",{"$f":"IF(K107=\"\", \"\", VLOOKUP(K107,Projekte!C:D,2,FALSE))","v":""}]
[null,null,null,"","",null,"","","","",null,null,null,"","","",{"$f":"IF(K108=\"\", \"\", VLOOKUP(K108,Projekte!C:D,2,FALSE))","v":""}]
[null,null,null,"","",null,"","","","",null,null,null,"","","",{"$f":"IF(K109=\"\", \"\", VLOOKUP(K109,Projekte!C:D,2,FALSE))","v":""}]
[null,null,null,"","",null,"","","","",null,null,null,"","","",{"$f":"IF(K110=\"\", \"\", VLOOKUP(K110,Projekte!C:D,2,FALSE))","v":""}]
[null,null,null,"","",null,"","","","",null,null,null,"","","",{"$f":"IF(K111=\"\", \"\", VLOOKUP(K111,Projekte!C:D,2,FALSE))","v":""}]
[null,null,null,"","",null,"","","","",null,null,null,"","","",{"$f":"IF(K112=\"\", \"\", VLOOKUP(K112,Projekte!C:D,2,FALSE))","v":""}]
[null,null,null,"","",null,"","","","",null,null,null,"","","",{"$f":"IF(K113=\"\", \"\", VLOOKUP(K113,Projekte!C:D,2,FALSE))","v":""}]
[null,null,null,"","",null,"","","","",null,null,null,"","","",{"$f":"IF(K114=\"\", \"\", VLOOKUP(K114,Projekte!C:D,2,FALSE))","v":""}]
[null,null,null,"","",null,"","","","",null,null,null,"","","",{"$f":"IF(K115=\"\", \"\", VLOOKUP(K115,Projekte!C:D,2,FALSE))","v":""}]
[null,null,null,"","",null,"","","","",null,null,null,"","","",{"$f":"IF(K116=\"\", \"\", VLOOKUP(K116,Projekte!C:D,2,FALSE))","v":""}]
[null,null,null,"","",null,"","","","",null,null,null,"","","",{"$f":"IF(K117=\"\", \"\", VLOOKUP(K117,Projekte!C:D,2,FALSE))","v":""}]
[null,null,null,"","",null,"","","","",null,null,null,"","","",{"$f":"IF(K118=\"\", \"\", VLOOKUP(K118,Projekte!C:D,2,FALSE))","v":""}]
[null,null,null,"","",null,"","","","",null,null,null,"","","",{"$f":"IF(K119=\"\", \"\", VLOOKUP(K119,Projekte!C:D,2,FALSE))","v":""}]
[null,null,null,"","",null,"","","","",null,null,null,"","","",{"$f":"IF(K120=\"\", \"\", VLOOKUP(K120,Projekte!C:D,2,FALSE))","v":""}]
[null,null,null,"","",null,"","","","",null,null,null,"","","",{"$f":"IF(K121=\"\", \"\", VLOOKUP(K121,Projekte!C:D,2,FALSE))","v":""}]
[null,null,null,"","",null,"","","","",null,null,null,"","","",{"$f":"IF(K122=\"\", \"\", VLOOKUP(K122,Projekte!C:D,2,FALSE))","v":""}]
[null,null,null,"","",null,{"$f":"IF(K123 = selectThisProjekt,E123, \"\")","v":""},"","","",null,null,null,"","","",{"$f":"IF(K123=\"\", \"\", VLOOKUP(K123,Projekte!C:D,2,FALSE))","v":""}]
[null,null,null,"","",null,"","","","",null,null,null,"","","",{"$f":"IF(K124=\"\", \"\", VLOOKUP(K124,Projekte!C:D,2,FALSE))","v":""}]
[null,null,null,"","",null,{"$f":"IF(K125 = selectThisProjekt,E125, \"\")","v":""},"","","",null,null,null,"","","",{"$f":"IF(K125=\"\", \"\", VLOOKUP(K125,Projekte!C:D,2,FALSE))","v":""}]
[null,null,null,"","",null,"","","","",null,null,null,"","","",{"$f":"IF(K126=\"\", \"\", VLOOKUP(K126,Projekte!C:D,2,FALSE))","v":""}]
[null,null,null,"","",null,"","","","",null,null,null,"","","",{"$f":"IF(K127=\"\", \"\", VLOOKUP(K127,Projekte!C:D,2,FALSE))","v":""}]
[null,null,null,"","",null,"","","","",null,null,null,"","","",{"$f":"IF(K128=\"\", \"\", VLOOKUP(K128,Projekte!C:D,2,FALSE))","v":""}]
[null,null,null,"","",null,"","","","",null,null,null,"","","",{"$f":"IF(K129=\"\", \"\", VLOOKUP(K129,Projekte!C:D,2,FALSE))","v":""}]
[null,null,null,"","",null,"","","","",null,null,null,"","","",{"$f":"IF(K130=\"\", \"\", VLOOKUP(K130,Projekte!C:D,2,FALSE))","v":""}]
[null,null,null,"","",null,"","","","",null,null,null,"","","",{"$f":"IF(K131=\"\", \"\", VLOOKUP(K131,Projekte!C:D,2,FALSE))","v":""}]
[null,null,null,{"$f":"IF(C132=\"\", \"\", C132-B132)","v":""},{"$f":"IF(D132=\"\", \"\", (C132-B132)*24)","v":""},null,{"$f":"IF(K132 = selectThisProjekt,E132, \"\")","v":""},"","","",null,null,null,"","","",{"$f":"IF(K132=\"\", \"\", VLOOKUP(K132,Projekte!C:D,2,FALSE))","v":""}]
[null,null,null,"","",null,"",{"$f":"IF(F133 = \"\", G133, \"\")","v":""},{"$f":"IF(LOWER(F133) = \"r\",G133,\"\")","v":""},{"$f":"IF(AND(F133<>\"\", LOWER(F133) <> \"r\"),G133,\"\")","v":""},null,null,null,"","","",{"$f":"IF(K133=\"\", \"\", VLOOKUP(K133,Projekte!C:D,2,FALSE))","v":""}]
[null,null,null,"","",null,"","","","",null,null,null,{"$f":"IF(M134<>\"\", \"\", IF(F134 = \"\", G134, \"\"))","v":""},{"$f":"IF(M134<>\"\", \"\", IF(LOWER(F134) = \"r\",G134,\"\"))","v":""},{"$f":"IF(M134<>\"\", \"\", IF(AND(F134<>\"\", LOWER(F134) <> \"r\"),G134,\"\"))","v":""},{"$f":"IF(K134=\"\", \"\", VLOOKUP(K134,Projekte!C:D,2,FALSE))","v":""}]
[null,null,null,"","",null,"","","","",null,null,null,"","","",{"$f":"IF(K135=\"\", \"\", VLOOKUP(K135,Projekte!C:D,2,FALSE))","v":""}]
[null,null,null,"","",null,"","","","",null,null,null,"","","",{"$f":"IF(K136=\"\", \"\", VLOOKUP(K136,Projekte!C:D,2,FALSE))","v":""}]
[null,null,null,"","",null,"","","","",null,null,null,"","","",{"$f":"IF(K137=\"\", \"\", VLOOKUP(K137,Projekte!C:D,2,FALSE))","v":""}]
[null,null,null,"","",null,"","","","",null,null,null,"","","",{"$f":"IF(K138=\"\", \"\", VLOOKUP(K138,Projekte!C:D,2,FALSE))","v":""}]
[null,null,null,"","",null,"","","","",null,null,null,"","","",{"$f":"IF(K139=\"\", \"\", VLOOKUP(K139,Projekte!C:D,2,FALSE))","v":""}]
[null,null,null,"","",null,"","","","",null,null,null,"","","",{"$f":"IF(K140=\"\", \"\", VLOOKUP(K140,Projekte!C:D,2,FALSE))","v":""}]
[null,null,null,"","",null,"","","","",null,null,null,"","","",{"$f":"IF(K141=\"\", \"\", VLOOKUP(K141,Projekte!C:D,2,FALSE))","v":""}]
[null,null,null,"","",null,"","","","",null,null,null,"","","",{"$f":"IF(K142=\"\", \"\", VLOOKUP(K142,Projekte!C:D,2,FALSE))","v":""}]
[null,null,null,"","",null,"","","","",null,null,null,"","","",{"$f":"IF(K143=\"\", \"\", VLOOKUP(K143,Projekte!C:D,2,FALSE))","v":""}]
[null,null,null,"","",null,"","","","",null,null,null,"","","",{"$f":"IF(K144=\"\", \"\", VLOOKUP(K144,Projekte!C:D,2,FALSE))","v":""}]
[null,null,null,"","",null,"","","","",null,null,null,"","","",{"$f":"IF(K145=\"\", \"\", VLOOKUP(K145,Projekte!C:D,2,FALSE))","v":""}]
[null,null,null,"","",null,"","","","",null,null,null,"","","",{"$f":"IF(K146=\"\", \"\", VLOOKUP(K146,Projekte!C:D,2,FALSE))","v":""}]
[null,null,null,"","",null,"","","","",null,null,null,"","","",{"$f":"IF(K147=\"\", \"\", VLOOKUP(K147,Projekte!C:D,2,FALSE))","v":""}]
[null,null,null,"","",null,"","","","",null,null,null,"","","",{"$f":"IF(K148=\"\", \"\", VLOOKUP(K148,Projekte!C:D,2,FALSE))","v":""}]
[null,null,null,"","",null,"","","","",null,null,null,"","","",{"$f":"IF(K149=\"\", \"\", VLOOKUP(K149,Projekte!C:D,2,FALSE))","v":""}]
[null,null,null,"","",null,"","","","",null,null,null,"","","",{"$f":"IF(K150=\"\", \"\", VLOOKUP(K150,Projekte!C:D,2,FALSE))","v":""}]
[null,null,null,"","",null,"","","","",null,null,null,"","","",{"$f":"IF(K151=\"\", \"\", VLOOKUP(K151,Projekte!C:D,2,FALSE))","v":""}]
[null,null,null,"","",null,"","","","",null,null,null,"","","",{"$f":"IF(K152=\"\", \"\", VLOOKUP(K152,Projekte!C:D,2,FALSE))","v":""}]
[null,null,null,"","",null,"","","","",null,null,null,"","","",{"$f":"IF(K153=\"\", \"\", VLOOKUP(K153,Projekte!C:D,2,FALSE))","v":""}]
[null,null,null,"","",null,"","","","",null,null,null,"","","",{"$f":"IF(K154=\"\", \"\", VLOOKUP(K154,Projekte!C:D,2,FALSE))","v":""}]
[null,null,null,"","",null,"","","","",null,null,null,"","","",{"$f":"IF(K155=\"\", \"\", VLOOKUP(K155,Projekte!C:D,2,FALSE))","v":""}]
[null,null,null,"","",null,"","","","",null,null,null,"","","",{"$f":"IF(K156=\"\", \"\", VLOOKUP(K156,Projekte!C:D,2,FALSE))","v":""}]
[null,null,null,"","",null,"","","","",null,null,null,"","","",{"$f":"IF(K157=\"\", \"\", VLOOKUP(K157,Projekte!C:D,2,FALSE))","v":""}]
[null,null,null,"","",null,"","","","",null,null,null,"","","",{"$f":"IF(K158=\"\", \"\", VLOOKUP(K158,Projekte!C:D,2,FALSE))","v":""}]
[null,null,null,"","",null,"","","","",null,null,null,"","","",{"$f":"IF(K159=\"\", \"\", VLOOKUP(K159,Projekte!C:D,2,FALSE))","v":""}]
[null,null,null,"","",null,"","","","",null,null,null,"","","",{"$f":"IF(K160=\"\", \"\", VLOOKUP(K160,Projekte!C:D,2,FALSE))","v":""}]
[null,null,null,"","",null,"","","","",null,null,null,"","","",{"$f":"IF(K161=\"\", \"\", VLOOKUP(K161,Projekte!C:D,2,FALSE))","v":""}]
[null,null,null,"","",null,"","","","",null,null,null,"","","",{"$f":"IF(K162=\"\", \"\", VLOOKUP(K162,Projekte!C:D,2,FALSE))","v":""}]
[null,null,null,"","",null,"","","","",null,null,null,"","","",{"$f":"IF(K163=\"\", \"\", VLOOKUP(K163,Projekte!C:D,2,FALSE))","v":""}]
[null,null,null,"","",null,{"$f":"IF(K164 = selectThisProjekt,E164, \"\")","v":""},"","","",null,null,null,"","","",{"$f":"IF(K164=\"\", \"\", VLOOKUP(K164,Projekte!C:D,2,FALSE))","v":""}]
[null,null,null,"","",null,"","","","",null,null,null,"","","",{"$f":"IF(K165=\"\", \"\", VLOOKUP(K165,Projekte!C:D,2,FALSE))","v":""}]
[null,null,null,"","",null,"","","","",null,null,null,"","","",{"$f":"IF(K166=\"\", \"\", VLOOKUP(K166,Projekte!C:D,2,FALSE))","v":""}]
[null,null,null,"","",null,"","","","",null,null,null,"","","",{"$f":"IF(K167=\"\", \"\", VLOOKUP(K167,Projekte!C:D,2,FALSE))","v":""}]
[null,null,null,"","",null,"","","","",null,null,null,"","","",{"$f":"IF(K168=\"\", \"\", VLOOKUP(K168,Projekte!C:D,2,FALSE))","v":""}]
[null,null,null,"","",null,"","","","",null,null,null,"","","",{"$f":"IF(K169=\"\", \"\", VLOOKUP(K169,Projekte!C:D,2,FALSE))","v":""}]
[null,null,null,"","",null,{"$f":"IF(K170 = selectThisProjekt,E170, \"\")","v":""},"","","",null,null,null,"","","",{"$f":"IF(K170=\"\", \"\", VLOOKUP(K170,Projekte!C:D,2,FALSE))","v":""}]
[null,null,null,"","",null,"","","","",null,null,null,"","","",{"$f":"IF(K171=\"\", \"\", VLOOKUP(K171,Projekte!C:D,2,FALSE))","v":""}]
[null,null,null,"","",null,"","","","",null,null,null,"","","",{"$f":"IF(K172=\"\", \"\", VLOOKUP(K172,Projekte!C:D,2,FALSE))","v":""}]
[null,null,null,"","",null,"","","","",null,null,null,"","","",{"$f":"IF(K173=\"\", \"\", VLOOKUP(K173,Projekte!C:D,2,FALSE))","v":""}]
[null,null,null,"","",null,"","","","",null,null,null,"","","",{"$f":"IF(K174=\"\", \"\", VLOOKUP(K174,Projekte!C:D,2,FALSE))","v":""}]
[null,null,null,"","",null,"","","","",null,null,null,"","","",{"$f":"IF(K175=\"\", \"\", VLOOKUP(K175,Projekte!C:D,2,FALSE))","v":""}]
[null,null,null,"","",null,"","","","",null,null,null,"","","",{"$f":"IF(K176=\"\", \"\", VLOOKUP(K176,Projekte!C:D,2,FALSE))","v":""}]
[null,null,null,"","",null,"","","","",null,null,null,"","","",{"$f":"IF(K177=\"\", \"\", VLOOKUP(K177,Projekte!C:D,2,FALSE))","v":""}]
[null,null,null,"","",null,"","","","",null,null,null,"","","",{"$f":"IF(K178=\"\", \"\", VLOOKUP(K178,Projekte!C:D,2,FALSE))","v":""}]
[null,null,null,"","",null,"","","","",null,null,null,"","","",{"$f":"IF(K179=\"\", \"\", VLOOKUP(K179,Projekte!C:D,2,FALSE))","v":""}]
[null,null,null,"","",null,"","","","",null,null,null,"","","",{"$f":"IF(K180=\"\", \"\", VLOOKUP(K180,Projekte!C:D,2,FALSE))","v":""}]
[null,null,null,"","",null,"","","","",null,null,null,"","","",{"$f":"IF(K181=\"\", \"\", VLOOKUP(K181,Projekte!C:D,2,FALSE))","v":""}]
[null,null,null,"","",null,"","","","",null,null,null,"","","",{"$f":"IF(K182=\"\", \"\", VLOOKUP(K182,Projekte!C:D,2,FALSE))","v":""}]
[null,null,null,"","",null,"","","","",null,null,null,"","","",{"$f":"IF(K183=\"\", \"\", VLOOKUP(K183,Projekte!C:D,2,FALSE))","v":""}]
[null,null,null,"","",null,"","","","",null,null,null,"","","",{"$f":"IF(K184=\"\", \"\", VLOOKUP(K184,Projekte!C:D,2,FALSE))","v":""}]
[null,null,null,"","",null,"","","","",null,null,null,"","","",{"$f":"IF(K185=\"\", \"\", VLOOKUP(K185,Projekte!C:D,2,FALSE))","v":""}]
[null,null,null,"","",null,"","","","",null,null,null,"","","",{"$f":"IF(K186=\"\", \"\", VLOOKUP(K186,Projekte!C:D,2,FALSE))","v":""}]
[null,null,null,"","",null,"","","","",null,null,null,"","","",{"$f":"IF(K187=\"\", \"\", VLOOKUP(K187,Projekte!C:D,2,FALSE))","v":""}]
[null,null,null,"","",null,"","","","",null,null,null,"","","",{"$f":"IF(K188=\"\", \"\", VLOOKUP(K188,Projekte!C:D,2,FALSE))","v":""}]
[null,null,null,"","",null,"","","","",null,null,null,"","","",{"$f":"IF(K189=\"\", \"\", VLOOKUP(K189,Projekte!C:D,2,FALSE))","v":""}]
[null,null,null,"","",null,"","","","",null,null,null,"","","",{"$f":"IF(K190=\"\", \"\", VLOOKUP(K190,Projekte!C:D,2,FALSE))","v":""}]
[null,null,null,"","",null,"","","","",null,null,null,"","","",{"$f":"IF(K191=\"\", \"\", VLOOKUP(K191,Projekte!C:D,2,FALSE))","v":""}]
[null,null,null,"","",null,"","","","",null,null,null,"","","",{"$f":"IF(K192=\"\", \"\", VLOOKUP(K192,Projekte!C:D,2,FALSE))","v":""}]
[null,null,null,"","",null,"","","","",null,null,null,"","","",{"$f":"IF(K193=\"\", \"\", VLOOKUP(K193,Projekte!C:D,2,FALSE))","v":""}]
[null,null,null,"","",null,"","","","",null,null,null,"","","",{"$f":"IF(K194=\"\", \"\", VLOOKUP(K194,Projekte!C:D,2,FALSE))","v":""}]
[null,null,null,"","",null,"","","","",null,null,null,"","","",{"$f":"IF(K195=\"\", \"\", VLOOKUP(K195,Projekte!C:D,2,FALSE))","v":""}]
[null,null,null,"","",null,"","","","",null,null,null,"","","",{"$f":"IF(K196=\"\", \"\", VLOOKUP(K196,Projekte!C:D,2,FALSE))","v":""}]
[null,null,null,"","",null,"","","","",null,null,null,"","","",{"$f":"IF(K197=\"\", \"\", VLOOKUP(K197,Projekte!C:D,2,FALSE))","v":""}]
[null,null,null,"","",null,"","","","",null,null,null,{"$f":"IF(M198<>\"\", \"\", IF(F198 = \"\", G198, \"\"))","v":""},{"$f":"IF(M198<>\"\", \"\", IF(LOWER(F198) = \"r\",G198,\"\"))","v":""},{"$f":"IF(M198<>\"\", \"\", IF(AND(F198<>\"\", LOWER(F198) <> \"r\"),G198,\"\"))","v":""},{"$f":"IF(K198=\"\", \"\", VLOOKUP(K198,Projekte!C:D,2,FALSE))","v":""}]
[null,null,null,"","",null,"","","","",null,null,null,"","","",{"$f":"IF(K199=\"\", \"\", VLOOKUP(K199,Projekte!C:D,2,FALSE))","v":""}]
[null,null,null,"","",null,"","","","",null,null,null,"","","",{"$f":"IF(K200=\"\", \"\", VLOOKUP(K200,Projekte!C:D,2,FALSE))","v":""}]
[null,null,null,"","",null,"","","","",null,null,null,"","","",{"$f":"IF(K201=\"\", \"\", VLOOKUP(K201,Projekte!C:D,2,FALSE))","v":""}]
[null,null,null,"","",null,"","","","",null,null,null,"","","",{"$f":"IF(K202=\"\", \"\", VLOOKUP(K202,Projekte!C:D,2,FALSE))","v":""}]
[null,null,null,"","",null,{"$f":"IF(K203 = selectThisProjekt,E203, \"\")","v":""},"","","",null,null,null,"","","",{"$f":"IF(K203=\"\", \"\", VLOOKUP(K203,Projekte!C:D,2,FALSE))","v":""}]
[null,null,null,"<Ende Formeln>"]

{"sheet":"Okt","index":10,"n_rows":204,"n_cols":17,"rows_kept":204,"cut":false,"hidden":false,"merged":[[0,13,0,15],[2,0,2,2]]}
[null,null,"DL-Zeiten von",{"$f":"AssignedToCfg","v":{"$error":"#REF!"}},null,null,null,null,null,null,null,null,null,"Faktura nicht erfasst"]
["Datum","Beginn","Ende","h","h,xx","r: Reise, \nx: nicht berechnen","Summe","Dienstleistung","Reise","nicht berechnen",null,"Tätigkeit","Faktura erfasst","Dienstleistung","Reise","nicht berechnen","Projektname"]
[null,null,null,null,null,"Summe",{"$f":"SUM(G4:G203)","v":0},{"$f":"SUM(H4:H203)","v":0},{"$f":"SUM(I4:I203)","v":0},{"$f":"SUM(J4:J203)","v":0},null,"<- für diesen ProjektBereich",null,{"$f":"SUM(N4:N203)","v":0},{"$f":"SUM(O4:O203)","v":0},{"$f":"SUM(P4:P203)","v":0}]
[null,null,null,{"$f":"IF(C4=\"\", \"\", C4-B4)","v":""},{"$f":"IF(D4=\"\", \"\", (C4-B4)*24)","v":""},null,{"$f":"IF(K4 = selectThisProjekt,E4, \"\")","v":""},{"$f":"IF(F4 = \"\", G4, \"\")","v":""},{"$f":"IF(LOWER(F4) = \"r\",G4,\"\")","v":""},{"$f":"IF(AND(F4<>\"\", LOWER(F4) <> \"r\"),G4,\"\")","v":""},null,null,null,{"$f":"IF(M4<>\"\", \"\", IF(F4 = \"\", G4, \"\"))","v":""},{"$f":"IF(M4<>\"\", \"\", IF(LOWER(F4) = \"r\",G4,\"\"))","v":""},{"$f":"IF(M4<>\"\", \"\", IF(AND(F4<>\"\", LOWER(F4) <> \"r\"),G4,\"\"))","v":""},{"$f":"IF(K4=\"\", \"\", VLOOKUP(K4,Projekte!C:D,2,FALSE))","v":""}]
[null,null,null,"","",null,"",{"$f":"IF(F5 = \"\", G5, \"\")","v":""},{"$f":"IF(LOWER(F5) = \"r\",G5,\"\")","v":""},{"$f":"IF(AND(F5<>\"\", LOWER(F5) <> \"r\"),G5,\"\")","v":""},null,null,null,{"$f":"IF(M5<>\"\", \"\", IF(F5 = \"\", G5, \"\"))","v":""},{"$f":"IF(M5<>\"\", \"\", IF(LOWER(F5) = \"r\",G5,\"\"))","v":""},{"$f":"IF(M5<>\"\", \"\", IF(AND(F5<>\"\", LOWER(F5) <> \"r\"),G5,\"\"))","v":""},{"$f":"IF(K5=\"\", \"\", VLOOKUP(K5,Projekte!C:D,2,FALSE))","v":""}]
[null,null,null,"","",null,"","","","",null,null,null,{"$f":"IF(M6<>\"\", \"\", IF(F6 = \"\", G6, \"\"))","v":""},{"$f":"IF(M6<>\"\", \"\", IF(LOWER(F6) = \"r\",G6,\"\"))","v":""},{"$f":"IF(M6<>\"\", \"\", IF(AND(F6<>\"\", LOWER(F6) <> \"r\"),G6,\"\"))","v":""},{"$f":"IF(K6=\"\", \"\", VLOOKUP(K6,Projekte!C:D,2,FALSE))","v":""}]
[null,null,null,"","",null,{"$f":"IF(K7 = selectThisProjekt,E7, \"\")","v":""},"","","",null,null,null,"","","",{"$f":"IF(K7=\"\", \"\", VLOOKUP(K7,Projekte!C:D,2,FALSE))","v":""}]
[null,null,null,"","",null,"","","","",null,null,null,"","","",{"$f":"IF(K8=\"\", \"\", VLOOKUP(K8,Projekte!C:D,2,FALSE))","v":""}]
[null,null,null,"","",null,"","","","",null,null,null,"","","",{"$f":"IF(K9=\"\", \"\", VLOOKUP(K9,Projekte!C:D,2,FALSE))","v":""}]
[null,null,null,"","",null,"","","","",null,null,null,"","","",{"$f":"IF(K10=\"\", \"\", VLOOKUP(K10,Projekte!C:D,2,FALSE))","v":""}]
[null,null,null,"","",null,"","","","",null,null,null,"","","",{"$f":"IF(K11=\"\", \"\", VLOOKUP(K11,Projekte!C:D,2,FALSE))","v":""}]
[null,null,null,"","",null,"","","","",null,null,null,"","","",{"$f":"IF(K12=\"\", \"\", VLOOKUP(K12,Projekte!C:D,2,FALSE))","v":""}]
[null,null,null,"","",null,"","","","",null,null,null,"","","",{"$f":"IF(K13=\"\", \"\", VLOOKUP(K13,Projekte!C:D,2,FALSE))","v":""}]
[null,null,null,"","",null,"","","","",null,null,null,"","","",{"$f":"IF(K14=\"\", \"\", VLOOKUP(K14,Projekte!C:D,2,FALSE))","v":""}]
[null,null,null,"","",null,"","","","",null,null,null,"","","",{"$f":"IF(K15=\"\", \"\", VLOOKUP(K15,Projekte!C:D,2,FALSE))","v":""}]
[null,null,null,"","",null,"","","","",null,null,null,"","","",{"$f":"IF(K16=\"\", \"\", VLOOKUP(K16,Projekte!C:D,2,FALSE))","v":""}]
[null,null,null,"","",null,"","","","",null,null,null,"","","",{"$f":"IF(K17=\"\", \"\", VLOOKUP(K17,Projekte!C:D,2,FALSE))","v":""}]
[null,null,null,"","",null,"","","","",null,null,null,"","","",{"$f":"IF(K18=\"\", \"\", VLOOKUP(K18,Projekte!C:D,2,FALSE))","v":""}]
[null,null,null,"","",null,"","","","",null,null,null,"","","",{"$f":"IF(K19=\"\", \"\", VLOOKUP(K19,Projekte!C:D,2,FALSE))","v":""}]
[null,null,null,"","",null,"","","","",null,null,null,"","","",{"$f":"IF(K20=\"\", \"\", VLOOKUP(K20,Projekte!C:D,2,FALSE))","v":""}]
[null,null,null,"","",null,"","","","",null,null,null,"","","",{"$f":"IF(K21=\"\", \"\", VLOOKUP(K21,Projekte!C:D,2,FALSE))","v":""}]
[null,null,null,"","",null,"","","","",null,null,null,"","","",{"$f":"IF(K22=\"\", \"\", VLOOKUP(K22,Projekte!C:D,2,FALSE))","v":""}]
[null,null,null,"","",null,"","","","",null,null,null,"","","",{"$f":"IF(K23=\"\", \"\", VLOOKUP(K23,Projekte!C:D,2,FALSE))","v":""}]
[null,null,null,"","",null,"","","","",null,null,null,"","","",{"$f":"IF(K24=\"\", \"\", VLOOKUP(K24,Projekte!C:D,2,FALSE))","v":""}]
[null,null,null,"","",null,"","","","",null,null,null,"","","",{"$f":"IF(K25=\"\", \"\", VLOOKUP(K25,Projekte!C:D,2,FALSE))","v":""}]
[null,null,null,"","",null,"","","","",null,null,null,"","","",{"$f":"IF(K26=\"\", \"\", VLOOKUP(K26,Projekte!C:D,2,FALSE))","v":""}]
[null,null,null,"","",null,"","","","",null,null,null,"","","",{"$f":"IF(K27=\"\", \"\", VLOOKUP(K27,Projekte!C:D,2,FALSE))","v":""}]
[null,null,null,"","",null,"","","","",null,null,null,"","","",{"$f":"IF(K28=\"\", \"\", VLOOKUP(K28,Projekte!C:D,2,FALSE))","v":""}]
[null,null,null,"","",null,"","","","",null,null,null,"","","",{"$f":"IF(K29=\"\", \"\", VLOOKUP(K29,Projekte!C:D,2,FALSE))","v":""}]
[null,null,null,"","",null,"","","","",null,null,null,"","","",{"$f":"IF(K30=\"\", \"\", VLOOKUP(K30,Projekte!C:D,2,FALSE))","v":""}]
[null,null,null,"","",null,"","","","",null,null,null,"","","",{"$f":"IF(K31=\"\", \"\", VLOOKUP(K31,Projekte!C:D,2,FALSE))","v":""}]
[null,null,null,"","",null,"","","","",null,null,null,"","","",{"$f":"IF(K32=\"\", \"\", VLOOKUP(K32,Projekte!C:D,2,FALSE))","v":""}]
[null,null,null,"","",null,"","","","",null,null,null,"","","",{"$f":"IF(K33=\"\", \"\", VLOOKUP(K33,Projekte!C:D,2,FALSE))","v":""}]
[null,null,null,"","",null,"","","","",null,null,null,"","","",{"$f":"IF(K34=\"\", \"\", VLOOKUP(K34,Projekte!C:D,2,FALSE))","v":""}]
[null,null,null,"","",null,"","","","",null,null,null,"","","",{"$f":"IF(K35=\"\", \"\", VLOOKUP(K35,Projekte!C:D,2,FALSE))","v":""}]
[null,null,null,"","",null,{"$f":"IF(K36 = selectThisProjekt,E36, \"\")","v":""},"","","",null,null,null,"","","",{"$f":"IF(K36=\"\", \"\", VLOOKUP(K36,Projekte!C:D,2,FALSE))","v":""}]
[null,null,null,"","",null,"","","","",null,null,null,"","","",{"$f":"IF(K37=\"\", \"\", VLOOKUP(K37,Projekte!C:D,2,FALSE))","v":""}]
[null,null,null,"","",null,"","","","",null,null,null,"","","",{"$f":"IF(K38=\"\", \"\", VLOOKUP(K38,Projekte!C:D,2,FALSE))","v":""}]
[null,null,null,"","",null,"","","","",null,null,null,"","","",{"$f":"IF(K39=\"\", \"\", VLOOKUP(K39,Projekte!C:D,2,FALSE))","v":""}]
[null,null,null,"","",null,"","","","",null,null,null,"","","",{"$f":"IF(K40=\"\", \"\", VLOOKUP(K40,Projekte!C:D,2,FALSE))","v":""}]
[null,null,null,"","",null,"","","","",null,null,null,"","","",{"$f":"IF(K41=\"\", \"\", VLOOKUP(K41,Projekte!C:D,2,FALSE))","v":""}]
[null,null,null,"","",null,"","","","",null,null,null,"","","",{"$f":"IF(K42=\"\", \"\", VLOOKUP(K42,Projekte!C:D,2,FALSE))","v":""}]
[null,null,null,"","",null,"","","","",null,null,null,"","","",{"$f":"IF(K43=\"\", \"\", VLOOKUP(K43,Projekte!C:D,2,FALSE))","v":""}]
[null,null,null,"","",null,"","","","",null,null,null,"","","",{"$f":"IF(K44=\"\", \"\", VLOOKUP(K44,Projekte!C:D,2,FALSE))","v":""}]
[null,null,null,"","",null,"","","","",null,null,null,"","","",{"$f":"IF(K45=\"\", \"\", VLOOKUP(K45,Projekte!C:D,2,FALSE))","v":""}]
[null,null,null,"","",null,"","","","",null,null,null,"","","",{"$f":"IF(K46=\"\", \"\", VLOOKUP(K46,Projekte!C:D,2,FALSE))","v":""}]
[null,null,null,"","",null,"","","","",null,null,null,"","","",{"$f":"IF(K47=\"\", \"\", VLOOKUP(K47,Projekte!C:D,2,FALSE))","v":""}]
[null,null,null,"","",null,"","","","",null,null,null,"","","",{"$f":"IF(K48=\"\", \"\", VLOOKUP(K48,Projekte!C:D,2,FALSE))","v":""}]
[null,null,null,"","",null,"","","","",null,null,null,"","","",{"$f":"IF(K49=\"\", \"\", VLOOKUP(K49,Projekte!C:D,2,FALSE))","v":""}]
[null,null,null,"","",null,"","","","",null,null,null,"","","",{"$f":"IF(K50=\"\", \"\", VLOOKUP(K50,Projekte!C:D,2,FALSE))","v":""}]
[null,null,null,"","",null,"","","","",null,null,null,"","","",{"$f":"IF(K51=\"\", \"\", VLOOKUP(K51,Projekte!C:D,2,FALSE))","v":""}]
[null,null,null,"","",null,"","","","",null,null,null,"","","",{"$f":"IF(K52=\"\", \"\", VLOOKUP(K52,Projekte!C:D,2,FALSE))","v":""}]
[null,null,null,"","",null,"","","","",null,null,null,"","","",{"$f":"IF(K53=\"\", \"\", VLOOKUP(K53,Projekte!C:D,2,FALSE))","v":""}]
[null,null,null,"","",null,"","","","",null,null,null,"","","",{"$f":"IF(K54=\"\", \"\", VLOOKUP(K54,Projekte!C:D,2,FALSE))","v":""}]
[null,null,null,"","",null,"","","","",null,null,null,"","","",{"$f":"IF(K55=\"\", \"\", VLOOKUP(K55,Projekte!C:D,2,FALSE))","v":""}]
[null,null,null,"","",null,"","","","",null,null,null,"","","",{"$f":"IF(K56=\"\", \"\", VLOOKUP(K56,Projekte!C:D,2,FALSE))","v":""}]
[null,null,null,"","",null,"","","","",null,null,null,"","","",{"$f":"IF(K57=\"\", \"\", VLOOKUP(K57,Projekte!C:D,2,FALSE))","v":""}]
[null,null,null,"","",null,"","","","",null,null,null,"","","",{"$f":"IF(K58=\"\", \"\", VLOOKUP(K58,Projekte!C:D,2,FALSE))","v":""}]
[null,null,null,"","",null,"","","","",null,null,null,"","","",{"$f":"IF(K59=\"\", \"\", VLOOKUP(K59,Projekte!C:D,2,FALSE))","v":""}]
[null,null,null,"","",null,"","","","",null,null,null,"","","",{"$f":"IF(K60=\"\", \"\", VLOOKUP(K60,Projekte!C:D,2,FALSE))","v":""}]
[null,null,null,"","",null,"","","","",null,null,null,"","","",{"$f":"IF(K61=\"\", \"\", VLOOKUP(K61,Projekte!C:D,2,FALSE))","v":""}]
[null,null,null,"","",null,"","","","",null,null,null,"","","",{"$f":"IF(K62=\"\", \"\", VLOOKUP(K62,Projekte!C:D,2,FALSE))","v":""}]
[null,null,null,"","",null,"","","","",null,null,null,"","","",{"$f":"IF(K63=\"\", \"\", VLOOKUP(K63,Projekte!C:D,2,FALSE))","v":""}]
[null,null,null,"","",null,"","","","",null,null,null,"","","",{"$f":"IF(K64=\"\", \"\", VLOOKUP(K64,Projekte!C:D,2,FALSE))","v":""}]
[null,null,null,"","",null,"","","","",null,null,null,"","","",{"$f":"IF(K65=\"\", \"\", VLOOKUP(K65,Projekte!C:D,2,FALSE))","v":""}]
[null,null,null,"","",null,"","","","",null,null,null,"","","",{"$f":"IF(K66=\"\", \"\", VLOOKUP(K66,Projekte!C:D,2,FALSE))","v":""}]
[null,null,null,"","",null,"","","","",null,null,null,"","","",{"$f":"IF(K67=\"\", \"\", VLOOKUP(K67,Projekte!C:D,2,FALSE))","v":""}]
[null,null,null,{"$f":"IF(C68=\"\", \"\", C68-B68)","v":""},{"$f":"IF(D68=\"\", \"\", (C68-B68)*24)","v":""},null,{"$f":"IF(K68 = selectThisProjekt,E68, \"\")","v":""},"","","",null,null,null,"","","",{"$f":"IF(K68=\"\", \"\", VLOOKUP(K68,Projekte!C:D,2,FALSE))","v":""}]
[null,null,null,"","",null,"",{"$f":"IF(F69 = \"\", G69, \"\")","v":""},{"$f":"IF(LOWER(F69) = \"r\",G69,\"\")","v":""},{"$f":"IF(AND(F69<>\"\", LOWER(F69) <> \"r\"),G69,\"\")","v":""},null,null,null,"","","",{"$f":"IF(K69=\"\", \"\", VLOOKUP(K69,Projekte!C:D,2,FALSE))","v":""}]
[null,null,null,"","",null,"","","","",null,null,null,{"$f":"IF(M70<>\"\", \"\", IF(F70 = \"\", G70, \"\"))","v":""},{"$f":"IF(M70<>\"\", \"\", IF(LOWER(F70) = \"r\",G70,\"\"))","v":""},{"$f":"IF(M70<>\"\", \"\", IF(AND(F70<>\"\", LOWER(F70) <> \"r\"),G70,\"\"))","v":""},{"$f":"IF(K70=\"\", \"\", VLOOKUP(K70,Projekte!C:D,2,FALSE))","v":""}]
[null,null,null,"","",null,"","","","",null,null,null,"","","",{"$f":"IF(K71=\"\", \"\", VLOOKUP(K71,Projekte!C:D,2,FALSE))","v":""}]
[null,null,null,"","",null,"","","","",null,null,null,"","","",{"$f":"IF(K72=\"\", \"\", VLOOKUP(K72,Projekte!C:D,2,FALSE))","v":""}]
[null,null,null,"","",null,"","","","",null,null,null,"","","",{"$f":"IF(K73=\"\", \"\", VLOOKUP(K73,Projekte!C:D,2,FALSE))","v":""}]
[null,null,null,"","",null,"","","","",null,null,null,"","","",{"$f":"IF(K74=\"\", \"\", VLOOKUP(K74,Projekte!C:D,2,FALSE))","v":""}]
[null,null,null,"","",null,"","","","",null,null,null,"","","",{"$f":"IF(K75=\"\", \"\", VLOOKUP(K75,Projekte!C:D,2,FALSE))","v":""}]
[null,null,null,"","",null,"","","","",null,null,null,"","","",{"$f":"IF(K76=\"\", \"\", VLOOKUP(K76,Projekte!C:D,2,FALSE))","v":""}]
[null,null,null,"","",null,"","","","",null,null,null,"","","",{"$f":"IF(K77=\"\", \"\", VLOOKUP(K77,Projekte!C:D,2,FALSE))","v":""}]
[null,null,null,"","",null,"","","","",null,null,null,"","","",{"$f":"IF(K78=\"\", \"\", VLOOKUP(K78,Projekte!C:D,2,FALSE))","v":""}]
[null,null,null,"","",null,"","","","",null,null,null,"","","",{"$f":"IF(K79=\"\", \"\", VLOOKUP(K79,Projekte!C:D,2,FALSE))","v":""}]
[null,null,null,"","",null,"","","","",null,null,null,"","","",{"$f":"IF(K80=\"\", \"\", VLOOKUP(K80,Projekte!C:D,2,FALSE))","v":""}]
[null,null,null,"","",null,"","","","",null,null,null,"","","",{"$f":"IF(K81=\"\", \"\", VLOOKUP(K81,Projekte!C:D,2,FALSE))","v":""}]
[null,null,null,"","",null,"","","","",null,null,null,"","","",{"$f":"IF(K82=\"\", \"\", VLOOKUP(K82,Projekte!C:D,2,FALSE))","v":""}]
[null,null,null,"","",null,"","","","",null,null,null,"","","",{"$f":"IF(K83=\"\", \"\", VLOOKUP(K83,Projekte!C:D,2,FALSE))","v":""}]
[null,null,null,"","",null,"","","","",null,null,null,"","","",{"$f":"IF(K84=\"\", \"\", VLOOKUP(K84,Projekte!C:D,2,FALSE))","v":""}]
[null,null,null,"","",null,"","","","",null,null,null,"","","",{"$f":"IF(K85=\"\", \"\", VLOOKUP(K85,Projekte!C:D,2,FALSE))","v":""}]
[null,null,null,"","",null,"","","","",null,null,null,"","","",{"$f":"IF(K86=\"\", \"\", VLOOKUP(K86,Projekte!C:D,2,FALSE))","v":""}]
[null,null,null,"","",null,"","","","",null,null,null,"","","",{"$f":"IF(K87=\"\", \"\", VLOOKUP(K87,Projekte!C:D,2,FALSE))","v":""}]
[null,null,null,"","",null,"","","","",null,null,null,"","","",{"$f":"IF(K88=\"\", \"\", VLOOKUP(K88,Projekte!C:D,2,FALSE))","v":""}]
[null,null,null,"","",null,"","","","",null,null,null,"","","",{"$f":"IF(K89=\"\", \"\", VLOOKUP(K89,Projekte!C:D,2,FALSE))","v":""}]
[null,null,null,"","",null,"","","","",null,null,null,"","","",{"$f":"IF(K90=\"\", \"\", VLOOKUP(K90,Projekte!C:D,2,FALSE))","v":""}]
[null,null,null,"","",null,"","","","",null,null,null,"","","",{"$f":"IF(K91=\"\", \"\", VLOOKUP(K91,Projekte!C:D,2,FALSE))","v":""}]
[null,null,null,"","",null,"","","","",null,null,null,"","","",{"$f":"IF(K92=\"\", \"\", VLOOKUP(K92,Projekte!C:D,2,FALSE))","v":""}]
[null,null,null,"","",null,"","","","",null,null,null,"","","",{"$f":"IF(K93=\"\", \"\", VLOOKUP(K93,Projekte!C:D,2,FALSE))","v":""}]
[null,null,null,"","",null,"","","","",null,null,null,"","","",{"$f":"IF(K94=\"\", \"\", VLOOKUP(K94,Projekte!C:D,2,FALSE))","v":""}]
[null,null,null,"","",null,"","","","",null,null,null,"","","",{"$f":"IF(K95=\"\", \"\", VLOOKUP(K95,Projekte!C:D,2,FALSE))","v":""}]
[null,null,null,"","",null,"","","","",null,null,null,"","","",{"$f":"IF(K96=\"\", \"\", VLOOKUP(K96,Projekte!C:D,2,FALSE))","v":""}]
[null,null,null,"","",null,"","","","",null,null,null,"","","",{"$f":"IF(K97=\"\", \"\", VLOOKUP(K97,Projekte!C:D,2,FALSE))","v":""}]
[null,null,null,"","",null,"","","","",null,null,null,"","","",{"$f":"IF(K98=\"\", \"\", VLOOKUP(K98,Projekte!C:D,2,FALSE))","v":""}]
[null,null,null,"","",null,"","","","",null,null,null,"","","",{"$f":"IF(K99=\"\", \"\", VLOOKUP(K99,Projekte!C:D,2,FALSE))","v":""}]
[null,null,null,"","",null,{"$f":"IF(K100 = selectThisProjekt,E100, \"\")","v":""},"","","",null,null,null,"","","",{"$f":"IF(K100=\"\", \"\", VLOOKUP(K100,Projekte!C:D,2,FALSE))","v":""}]
[null,null,null,"","",null,"","","","",null,null,null,"","","",{"$f":"IF(K101=\"\", \"\", VLOOKUP(K101,Projekte!C:D,2,FALSE))","v":""}]
[null,null,null,"","",null,"","","","",null,null,null,"","","",{"$f":"IF(K102=\"\", \"\", VLOOKUP(K102,Projekte!C:D,2,FALSE))","v":""}]
[null,null,null,"","",null,"","","","",null,null,null,"","","",{"$f":"IF(K103=\"\", \"\", VLOOKUP(K103,Projekte!C:D,2,FALSE))","v":""}]
[null,null,null,"","",null,"","","","",null,null,null,"","","",{"$f":"IF(K104=\"\", \"\", VLOOKUP(K104,Projekte!C:D,2,FALSE))","v":""}]
[null,null,null,"","",null,"","","","",null,null,null,"","","",{"$f":"IF(K105=\"\", \"\", VLOOKUP(K105,Projekte!C:D,2,FALSE))","v":""}]
[null,null,null,"","",null,"","","","",null,null,null,"","","",{"$f":"IF(K106=\"\", \"\", VLOOKUP(K106,Projekte!C:D,2,FALSE))","v":""}]
[null,null,null,"","",null,"","","","",null,null,null,"","","",{"$f":"IF(K107=\"\", \"\", VLOOKUP(K107,Projekte!C:D,2,FALSE))","v":""}]
[null,null,null,"","",null,"","","","",null,null,null,"","","",{"$f":"IF(K108=\"\", \"\", VLOOKUP(K108,Projekte!C:D,2,FALSE))","v":""}]
[null,null,null,"","",null,"","","","",null,null,null,"","","",{"$f":"IF(K109=\"\", \"\", VLOOKUP(K109,Projekte!C:D,2,FALSE))","v":""}]
[null,null,null,"","",null,"","","","",null,null,null,"","","",{"$f":"IF(K110=\"\", \"\", VLOOKUP(K110,Projekte!C:D,2,FALSE))","v":""}]
[null,null,null,"","",null,"","","","",null,null,null,"","","",{"$f":"IF(K111=\"\", \"\", VLOOKUP(K111,Projekte!C:D,2,FALSE))","v":""}]
[null,null,null,"","",null,"","","","",null,null,null,"","","",{"$f":"IF(K112=\"\", \"\", VLOOKUP(K112,Projekte!C:D,2,FALSE))","v":""}]
[null,null,null,"","",null,"","","","",null,null,null,"","","",{"$f":"IF(K113=\"\", \"\", VLOOKUP(K113,Projekte!C:D,2,FALSE))","v":""}]
[null,null,null,"","",null,"","","","",null,null,null,"","","",{"$f":"IF(K114=\"\", \"\", VLOOKUP(K114,Projekte!C:D,2,FALSE))","v":""}]
[null,null,null,"","",null,"","","","",null,null,null,"","","",{"$f":"IF(K115=\"\", \"\", VLOOKUP(K115,Projekte!C:D,2,FALSE))","v":""}]
[null,null,null,"","",null,"","","","",null,null,null,"","","",{"$f":"IF(K116=\"\", \"\", VLOOKUP(K116,Projekte!C:D,2,FALSE))","v":""}]
[null,null,null,"","",null,"","","","",null,null,null,"","","",{"$f":"IF(K117=\"\", \"\", VLOOKUP(K117,Projekte!C:D,2,FALSE))","v":""}]
[null,null,null,"","",null,"","","","",null,null,null,"","","",{"$f":"IF(K118=\"\", \"\", VLOOKUP(K118,Projekte!C:D,2,FALSE))","v":""}]
[null,null,null,"","",null,"","","","",null,null,null,"","","",{"$f":"IF(K119=\"\", \"\", VLOOKUP(K119,Projekte!C:D,2,FALSE))","v":""}]
[null,null,null,"","",null,"","","","",null,null,null,"","","",{"$f":"IF(K120=\"\", \"\", VLOOKUP(K120,Projekte!C:D,2,FALSE))","v":""}]
[null,null,null,"","",null,"","","","",null,null,null,"","","",{"$f":"IF(K121=\"\", \"\", VLOOKUP(K121,Projekte!C:D,2,FALSE))","v":""}]
[null,null,null,"","",null,"","","","",null,null,null,"","","",{"$f":"IF(K122=\"\", \"\", VLOOKUP(K122,Projekte!C:D,2,FALSE))","v":""}]
[null,null,null,"","",null,{"$f":"IF(K123 = selectThisProjekt,E123, \"\")","v":""},"","","",null,null,null,"","","",{"$f":"IF(K123=\"\", \"\", VLOOKUP(K123,Projekte!C:D,2,FALSE))","v":""}]
[null,null,null,"","",null,"","","","",null,null,null,"","","",{"$f":"IF(K124=\"\", \"\", VLOOKUP(K124,Projekte!C:D,2,FALSE))","v":""}]
[null,null,null,"","",null,{"$f":"IF(K125 = selectThisProjekt,E125, \"\")","v":""},"","","",null,null,null,"","","",{"$f":"IF(K125=\"\", \"\", VLOOKUP(K125,Projekte!C:D,2,FALSE))","v":""}]
[null,null,null,"","",null,"","","","",null,null,null,"","","",{"$f":"IF(K126=\"\", \"\", VLOOKUP(K126,Projekte!C:D,2,FALSE))","v":""}]
[null,null,null,"","",null,"","","","",null,null,null,"","","",{"$f":"IF(K127=\"\", \"\", VLOOKUP(K127,Projekte!C:D,2,FALSE))","v":""}]
[null,null,null,"","",null,"","","","",null,null,null,"","","",{"$f":"IF(K128=\"\", \"\", VLOOKUP(K128,Projekte!C:D,2,FALSE))","v":""}]
[null,null,null,"","",null,"","","","",null,null,null,"","","",{"$f":"IF(K129=\"\", \"\", VLOOKUP(K129,Projekte!C:D,2,FALSE))","v":""}]
[null,null,null,"","",null,"","","","",null,null,null,"","","",{"$f":"IF(K130=\"\", \"\", VLOOKUP(K130,Projekte!C:D,2,FALSE))","v":""}]
[null,null,null,"","",null,"","","","",null,null,null,"","","",{"$f":"IF(K131=\"\", \"\", VLOOKUP(K131,Projekte!C:D,2,FALSE))","v":""}]
[null,null,null,{"$f":"IF(C132=\"\", \"\", C132-B132)","v":""},{"$f":"IF(D132=\"\", \"\", (C132-B132)*24)","v":""},null,{"$f":"IF(K132 = selectThisProjekt,E132, \"\")","v":""},"","","",null,null,null,"","","",{"$f":"IF(K132=\"\", \"\", VLOOKUP(K132,Projekte!C:D,2,FALSE))","v":""}]
[null,null,null,"","",null,"",{"$f":"IF(F133 = \"\", G133, \"\")","v":""},{"$f":"IF(LOWER(F133) = \"r\",G133,\"\")","v":""},{"$f":"IF(AND(F133<>\"\", LOWER(F133) <> \"r\"),G133,\"\")","v":""},null,null,null,"","","",{"$f":"IF(K133=\"\", \"\", VLOOKUP(K133,Projekte!C:D,2,FALSE))","v":""}]
[null,null,null,"","",null,"","","","",null,null,null,{"$f":"IF(M134<>\"\", \"\", IF(F134 = \"\", G134, \"\"))","v":""},{"$f":"IF(M134<>\"\", \"\", IF(LOWER(F134) = \"r\",G134,\"\"))","v":""},{"$f":"IF(M134<>\"\", \"\", IF(AND(F134<>\"\", LOWER(F134) <> \"r\"),G134,\"\"))","v":""},{"$f":"IF(K134=\"\", \"\", VLOOKUP(K134,Projekte!C:D,2,FALSE))","v":""}]
[null,null,null,"","",null,"","","","",null,null,null,"","","",{"$f":"IF(K135=\"\", \"\", VLOOKUP(K135,Projekte!C:D,2,FALSE))","v":""}]
[null,null,null,"","",null,"","","","",null,null,null,"","","",{"$f":"IF(K136=\"\", \"\", VLOOKUP(K136,Projekte!C:D,2,FALSE))","v":""}]
[null,null,null,"","",null,"","","","",null,null,null,"","","",{"$f":"IF(K137=\"\", \"\", VLOOKUP(K137,Projekte!C:D,2,FALSE))","v":""}]
[null,null,null,"","",null,"","","","",null,null,null,"","","",{"$f":"IF(K138=\"\", \"\", VLOOKUP(K138,Projekte!C:D,2,FALSE))","v":""}]
[null,null,null,"","",null,"","","","",null,null,null,"","","",{"$f":"IF(K139=\"\", \"\", VLOOKUP(K139,Projekte!C:D,2,FALSE))","v":""}]
[null,null,null,"","",null,"","","","",null,null,null,"","","",{"$f":"IF(K140=\"\", \"\", VLOOKUP(K140,Projekte!C:D,2,FALSE))","v":""}]
[null,null,null,"","",null,"","","","",null,null,null,"","","",{"$f":"IF(K141=\"\", \"\", VLOOKUP(K141,Projekte!C:D,2,FALSE))","v":""}]
[null,null,null,"","",null,"","","","",null,null,null,"","","",{"$f":"IF(K142=\"\", \"\", VLOOKUP(K142,Projekte!C:D,2,FALSE))","v":""}]
[null,null,null,"","",null,"","","","",null,null,null,"","","",{"$f":"IF(K143=\"\", \"\", VLOOKUP(K143,Projekte!C:D,2,FALSE))","v":""}]
[null,null,null,"","",null,"","","","",null,null,null,"","","",{"$f":"IF(K144=\"\", \"\", VLOOKUP(K144,Projekte!C:D,2,FALSE))","v":""}]
[null,null,null,"","",null,"","","","",null,null,null,"","","",{"$f":"IF(K145=\"\", \"\", VLOOKUP(K145,Projekte!C:D,2,FALSE))","v":""}]
[null,null,null,"","",null,"","","","",null,null,null,"","","",{"$f":"IF(K146=\"\", \"\", VLOOKUP(K146,Projekte!C:D,2,FALSE))","v":""}]
[null,null,null,"","",null,"","","","",null,null,null,"","","",{"$f":"IF(K147=\"\", \"\", VLOOKUP(K147,Projekte!C:D,2,FALSE))","v":""}]
[null,null,null,"","",null,"","","","",null,null,null,"","","",{"$f":"IF(K148=\"\", \"\", VLOOKUP(K148,Projekte!C:D,2,FALSE))","v":""}]
[null,null,null,"","",null,"","","","",null,null,null,"","","",{"$f":"IF(K149=\"\", \"\", VLOOKUP(K149,Projekte!C:D,2,FALSE))","v":""}]
[null,null,null,"","",null,"","","","",null,null,null,"","","",{"$f":"IF(K150=\"\", \"\", VLOOKUP(K150,Projekte!C:D,2,FALSE))","v":""}]
[null,null,null,"","",null,"","","","",null,null,null,"","","",{"$f":"IF(K151=\"\", \"\", VLOOKUP(K151,Projekte!C:D,2,FALSE))","v":""}]
[null,null,null,"","",null,"","","","",null,null,null,"","","",{"$f":"IF(K152=\"\", \"\", VLOOKUP(K152,Projekte!C:D,2,FALSE))","v":""}]
[null,null,null,"","",null,"","","","",null,null,null,"","","",{"$f":"IF(K153=\"\", \"\", VLOOKUP(K153,Projekte!C:D,2,FALSE))","v":""}]
[null,null,null,"","",null,"","","","",null,null,null,"","","",{"$f":"IF(K154=\"\", \"\", VLOOKUP(K154,Projekte!C:D,2,FALSE))","v":""}]
[null,null,null,"","",null,"","","","",null,null,null,"","","",{"$f":"IF(K155=\"\", \"\", VLOOKUP(K155,Projekte!C:D,2,FALSE))","v":""}]
[null,null,null,"","",null,"","","","",null,null,null,"","","",{"$f":"IF(K156=\"\", \"\", VLOOKUP(K156,Projekte!C:D,2,FALSE))","v":""}]
[null,null,null,"","",null,"","","","",null,null,null,"","","",{"$f":"IF(K157=\"\", \"\", VLOOKUP(K157,Projekte!C:D,2,FALSE))","v":""}]
[null,null,null,"","",null,"","","","",null,null,null,"","","",{"$f":"IF(K158=\"\", \"\", VLOOKUP(K158,Projekte!C:D,2,FALSE))","v":""}]
[null,null,null,"","",null,"","","","",null,null,null,"","","",{"$f":"IF(K159=\"\", \"\", VLOOKUP(K159,Projekte!C:D,2,FALSE))","v":""}]
[null,null,null,"","",null,"","","","",null,null,null,"","","",{"$f":"IF(K160=\"\", \"\", VLOOKUP(K160,Projekte!C:D,2,FALSE))","v":""}]
[null,null,null,"","",null,"","","","",null,null,null,"","","",{"$f":"IF(K161=\"\", \"\", VLOOKUP(K161,Projekte!C:D,2,FALSE))","v":""}]
[null,null,null,"","",null,"","","","",null,null,null,"","","",{"$f":"IF(K162=\"\", \"\", VLOOKUP(K162,Projekte!C:D,2,FALSE))","v":""}]
[null,null,null,"","",null,"","","","",null,null,null,"","","",{"$f":"IF(K163=\"\", \"\", VLOOKUP(K163,Projekte!C:D,2,FALSE))","v":""}]
[null,null,null,"","",null,{"$f":"IF(K164 = selectThisProjekt,E164, \"\")","v":""},"","","",null,null,null,"","","",{"$f":"IF(K164=\"\", \"\", VLOOKUP(K164,Projekte!C:D,2,FALSE))","v":""}]
[null,null,null,"","",null,"","","","",null,null,null,"","","",{"$f":"IF(K165=\"\", \"\", VLOOKUP(K165,Projekte!C:D,2,FALSE))","v":""}]
[null,null,null,"","",null,"","","","",null,null,null,"","","",{"$f":"IF(K166=\"\", \"\", VLOOKUP(K166,Projekte!C:D,2,FALSE))","v":""}]
[null,null,null,"","",null,"","","","",null,null,null,"","","",{"$f":"IF(K167=\"\", \"\", VLOOKUP(K167,Projekte!C:D,2,FALSE))","v":""}]
[null,null,null,"","",null,"","","","",null,null,null,"","","",{"$f":"IF(K168=\"\", \"\", VLOOKUP(K168,Projekte!C:D,2,FALSE))","v":""}]
[null,null,null,"","",null,"","","","",null,null,null,"","","",{"$f":"IF(K169=\"\", \"\", VLOOKUP(K169,Projekte!C:D,2,FALSE))","v":""}]
[null,null,null,"","",null,{"$f":"IF(K170 = selectThisProjekt,E170, \"\")","v":""},"","","",null,null,null,"","","",{"$f":"IF(K170=\"\", \"\", VLOOKUP(K170,Projekte!C:D,2,FALSE))","v":""}]
[null,null,null,"","",null,"","","","",null,null,null,"","","",{"$f":"IF(K171=\"\", \"\", VLOOKUP(K171,Projekte!C:D,2,FALSE))","v":""}]
[null,null,null,"","",null,"","","","",null,null,null,"","","",{"$f":"IF(K172=\"\", \"\", VLOOKUP(K172,Projekte!C:D,2,FALSE))","v":""}]
[null,null,null,"","",null,"","","","",null,null,null,"","","",{"$f":"IF(K173=\"\", \"\", VLOOKUP(K173,Projekte!C:D,2,FALSE))","v":""}]
[null,null,null,"","",null,"","","","",null,null,null,"","","",{"$f":"IF(K174=\"\", \"\", VLOOKUP(K174,Projekte!C:D,2,FALSE))","v":""}]
[null,null,null,"","",null,"","","","",null,null,null,"","","",{"$f":"IF(K175=\"\", \"\", VLOOKUP(K175,Projekte!C:D,2,FALSE))","v":""}]
[null,null,null,"","",null,"","","","",null,null,null,"","","",{"$f":"IF(K176=\"\", \"\", VLOOKUP(K176,Projekte!C:D,2,FALSE))","v":""}]
[null,null,null,"","",null,"","","","",null,null,null,"","","",{"$f":"IF(K177=\"\", \"\", VLOOKUP(K177,Projekte!C:D,2,FALSE))","v":""}]
[null,null,null,"","",null,"","","","",null,null,null,"","","",{"$f":"IF(K178=\"\", \"\", VLOOKUP(K178,Projekte!C:D,2,FALSE))","v":""}]
[null,null,null,"","",null,"","","","",null,null,null,"","","",{"$f":"IF(K179=\"\", \"\", VLOOKUP(K179,Projekte!C:D,2,FALSE))","v":""}]
[null,null,null,"","",null,"","","","",null,null,null,"","","",{"$f":"IF(K180=\"\", \"\", VLOOKUP(K180,Projekte!C:D,2,FALSE))","v":""}]
[null,null,null,"","",null,"","","","",null,null,null,"","","",{"$f":"IF(K181=\"\", \"\", VLOOKUP(K181,Projekte!C:D,2,FALSE))","v":""}]
[null,null,null,"","",null,"","","","",null,null,null,"","","",{"$f":"IF(K182=\"\", \"\", VLOOKUP(K182,Projekte!C:D,2,FALSE))","v":""}]
[null,null,null,"","",null,"","","","",null,null,null,"","","",{"$f":"IF(K183=\"\", \"\", VLOOKUP(K183,Projekte!C:D,2,FALSE))","v":""}]
[null,null,null,"","",null,"","","","",null,null,null,"","","",{"$f":"IF(K184=\"\", \"\", VLOOKUP(K184,Projekte!C:D,2,FALSE))","v":""}]
[null,null,null,"","",null,"","","","",null,null,null,"","","",{"$f":"IF(K185=\"\", \"\", VLOOKUP(K185,Projekte!C:D,2,FALSE))","v":""}]
[null,null,null,"","",null,"","","","",null,null,null,"","","",{"$f":"IF(K186=\"\", \"\", VLOOKUP(K186,Projekte!C:D,2,FALSE))","v":""}]
[null,null,null,"","",null,"","","","",null,null,null,"","","",{"$f":"IF(K187=\"\", \"\", VLOOKUP(K187,Projekte!C:D,2,FALSE))","v":""}]
[null,null,null,"","",null,"","","","",null,null,null,"","","",{"$f":"IF(K188=\"\", \"\", VLOOKUP(K188,Projekte!C:D,2,FALSE))","v":""}]
[null,null,null,"","",null,"","","","",null,null,null,"","","",{"$f":"IF(K189=\"\", \"\", VLOOKUP(K189,Projekte!C:D,2,FALSE))","v":""}]
[null,null,null,"","",null,"","","","",null,null,null,"","","",{"$f":"IF(K190=\"\", \"\", VLOOKUP(K190,Projekte!C:D,2,FALSE))","v":""}]
[null,null,null,"","",null,"","","","",null,null,null,"","","",{"$f":"IF(K191=\"\", \"\", VLOOKUP(K191,Projekte!C:D,2,FALSE))","v":""}]
[null,null,null,"","",null,"","","","",null,null,null,"","","",{"$f":"IF(K192=\"\", \"\", VLOOKUP(K192,Projekte!C:D,2,FALSE))","v":""}]
[null,null,null,"","",null,"","","","",null,null,null,"","","",{"$f":"IF(K193=\"\", \"\", VLOOKUP(K193,Projekte!C:D,2,FALSE))","v":""}]
[null,null,null,"","",null,"","","","",null,null,null,"","","",{"$f":"IF(K194=\"\", \"\", VLOOKUP(K194,Projekte!C:D,2,FALSE))","v":""}]
[null,null,null,"","",null,"","","","",null,null,null,"","","",{"$f":"IF(K195=\"\", \"\", VLOOKUP(K195,Projekte!C:D,2,FALSE))","v":""}]
[null,null,null,"","",null,"","","","",null,null,null,"","","",{"$f":"IF(K196=\"\", \"\", VLOOKUP(K196,Projekte!C:D,2,FALSE))","v":""}]
[null,null,null,"","",null,"","","","",null,null,null,"","","",{"$f":"IF(K197=\"\", \"\", VLOOKUP(K197,Projekte!C:D,2,FALSE))","v":""}]
[null,null,null,"","",null,"","","","",null,null,null,{"$f":"IF(M198<>\"\", \"\", IF(F198 = \"\", G198, \"\"))","v":""},{"$f":"IF(M198<>\"\", \"\", IF(LOWER(F198) = \"r\",G198,\"\"))","v":""},{"$f":"IF(M198<>\"\", \"\", IF(AND(F198<>\"\", LOWER(F198) <> \"r\"),G198,\"\"))","v":""},{"$f":"IF(K198=\"\", \"\", VLOOKUP(K198,Projekte!C:D,2,FALSE))","v":""}]
[null,null,null,"","",null,"","","","",null,null,null,"","","",{"$f":"IF(K199=\"\", \"\", VLOOKUP(K199,Projekte!C:D,2,FALSE))","v":""}]
[null,null,null,"","",null,"","","","",null,null,null,"","","",{"$f":"IF(K200=\"\", \"\", VLOOKUP(K200,Projekte!C:D,2,FALSE))","v":""}]
[null,null,null,"","",null,"","","","",null,null,null,"","","",{"$f":"IF(K201=\"\", \"\", VLOOKUP(K201,Projekte!C:D,2,FALSE))","v":""}]
[null,null,null,"","",null,"","","","",null,null,null,"","","",{"$f":"IF(K202=\"\", \"\", VLOOKUP(K202,Projekte!C:D,2,FALSE))","v":""}]
[null,null,null,"","",null,{"$f":"IF(K203 = selectThisProjekt,E203, \"\")","v":""},"","","",null,null,null,"","","",{"$f":"IF(K203=\"\", \"\", VLOOKUP(K203,Projekte!C:D,2,FALSE))","v":""}]
[null,null,null,"<Ende Formeln>"]

{"sheet":"Nov","index":11,"n_rows":204,"n_cols":17,"rows_kept":204,"cut":false,"hidden":false,"merged":[[0,13,0,15],[2,0,2,2]]}
[null,null,"DL-Zeiten von",{"$f":"AssignedToCfg","v":{"$error":"#REF!"}},null,null,null,null,null,null,null,null,null,"Faktura nicht erfasst"]
["Datum","Beginn","Ende","h","h,xx","r: Reise, \nx: nicht berechnen","Summe","Dienstleistung","Reise","nicht berechnen",null,"Tätigkeit","Faktura erfasst","Dienstleistung","Reise","nicht berechnen","Projektname"]
[null,null,null,null,null,"Summe",{"$f":"SUM(G4:G203)","v":0},{"$f":"SUM(H4:H203)","v":0},{"$f":"SUM(I4:I203)","v":0},{"$f":"SUM(J4:J203)","v":0},null,"<- für diesen ProjektBereich",null,{"$f":"SUM(N4:N203)","v":0},{"$f":"SUM(O4:O203)","v":0},{"$f":"SUM(P4:P203)","v":0}]
[null,null,null,{"$f":"IF(C4=\"\", \"\", C4-B4)","v":""},{"$f":"IF(D4=\"\", \"\", (C4-B4)*24)","v":""},null,{"$f":"IF(K4 = selectThisProjekt,E4, \"\")","v":""},{"$f":"IF(F4 = \"\", G4, \"\")","v":""},{"$f":"IF(LOWER(F4) = \"r\",G4,\"\")","v":""},{"$f":"IF(AND(F4<>\"\", LOWER(F4) <> \"r\"),G4,\"\")","v":""},null,null,null,{"$f":"IF(M4<>\"\", \"\", IF(F4 = \"\", G4, \"\"))","v":""},{"$f":"IF(M4<>\"\", \"\", IF(LOWER(F4) = \"r\",G4,\"\"))","v":""},{"$f":"IF(M4<>\"\", \"\", IF(AND(F4<>\"\", LOWER(F4) <> \"r\"),G4,\"\"))","v":""},{"$f":"IF(K4=\"\", \"\", VLOOKUP(K4,Projekte!C:D,2,FALSE))","v":""}]
[null,null,null,"","",null,"",{"$f":"IF(F5 = \"\", G5, \"\")","v":""},{"$f":"IF(LOWER(F5) = \"r\",G5,\"\")","v":""},{"$f":"IF(AND(F5<>\"\", LOWER(F5) <> \"r\"),G5,\"\")","v":""},null,null,null,{"$f":"IF(M5<>\"\", \"\", IF(F5 = \"\", G5, \"\"))","v":""},{"$f":"IF(M5<>\"\", \"\", IF(LOWER(F5) = \"r\",G5,\"\"))","v":""},{"$f":"IF(M5<>\"\", \"\", IF(AND(F5<>\"\", LOWER(F5) <> \"r\"),G5,\"\"))","v":""},{"$f":"IF(K5=\"\", \"\", VLOOKUP(K5,Projekte!C:D,2,FALSE))","v":""}]
[null,null,null,"","",null,"","","","",null,null,null,{"$f":"IF(M6<>\"\", \"\", IF(F6 = \"\", G6, \"\"))","v":""},{"$f":"IF(M6<>\"\", \"\", IF(LOWER(F6) = \"r\",G6,\"\"))","v":""},{"$f":"IF(M6<>\"\", \"\", IF(AND(F6<>\"\", LOWER(F6) <> \"r\"),G6,\"\"))","v":""},{"$f":"IF(K6=\"\", \"\", VLOOKUP(K6,Projekte!C:D,2,FALSE))","v":""}]
[null,null,null,"","",null,"","","","",null,null,null,"","","",{"$f":"IF(K7=\"\", \"\", VLOOKUP(K7,Projekte!C:D,2,FALSE))","v":""}]
[null,null,null,"","",null,"","","","",null,null,null,"","","",{"$f":"IF(K8=\"\", \"\", VLOOKUP(K8,Projekte!C:D,2,FALSE))","v":""}]
[null,null,null,"","",null,"","","","",null,null,null,"","","",{"$f":"IF(K9=\"\", \"\", VLOOKUP(K9,Projekte!C:D,2,FALSE))","v":""}]
[null,null,null,"","",null,"","","","",null,null,null,"","","",{"$f":"IF(K10=\"\", \"\", VLOOKUP(K10,Projekte!C:D,2,FALSE))","v":""}]
[null,null,null,"","",null,"","","","",null,null,null,"","","",{"$f":"IF(K11=\"\", \"\", VLOOKUP(K11,Projekte!C:D,2,FALSE))","v":""}]
[null,null,null,"","",null,"","","","",null,null,null,"","","",{"$f":"IF(K12=\"\", \"\", VLOOKUP(K12,Projekte!C:D,2,FALSE))","v":""}]
[null,null,null,"","",null,"","","","",null,null,null,"","","",{"$f":"IF(K13=\"\", \"\", VLOOKUP(K13,Projekte!C:D,2,FALSE))","v":""}]
[null,null,null,"","",null,"","","","",null,null,null,"","","",{"$f":"IF(K14=\"\", \"\", VLOOKUP(K14,Projekte!C:D,2,FALSE))","v":""}]
[null,null,null,"","",null,"","","","",null,null,null,"","","",{"$f":"IF(K15=\"\", \"\", VLOOKUP(K15,Projekte!C:D,2,FALSE))","v":""}]
[null,null,null,"","",null,"","","","",null,null,null,"","","",{"$f":"IF(K16=\"\", \"\", VLOOKUP(K16,Projekte!C:D,2,FALSE))","v":""}]
[null,null,null,"","",null,"","","","",null,null,null,"","","",{"$f":"IF(K17=\"\", \"\", VLOOKUP(K17,Projekte!C:D,2,FALSE))","v":""}]
[null,null,null,"","",null,"","","","",null,null,null,"","","",{"$f":"IF(K18=\"\", \"\", VLOOKUP(K18,Projekte!C:D,2,FALSE))","v":""}]
[null,null,null,"","",null,"","","","",null,null,null,"","","",{"$f":"IF(K19=\"\", \"\", VLOOKUP(K19,Projekte!C:D,2,FALSE))","v":""}]
[null,null,null,"","",null,"","","","",null,null,null,"","","",{"$f":"IF(K20=\"\", \"\", VLOOKUP(K20,Projekte!C:D,2,FALSE))","v":""}]
[null,null,null,"","",null,"","","","",null,null,null,"","","",{"$f":"IF(K21=\"\", \"\", VLOOKUP(K21,Projekte!C:D,2,FALSE))","v":""}]
[null,null,null,"","",null,"","","","",null,null,null,"","","",{"$f":"IF(K22=\"\", \"\", VLOOKUP(K22,Projekte!C:D,2,FALSE))","v":""}]
[null,null,null,"","",null,"","","","",null,null,null,"","","",{"$f":"IF(K23=\"\", \"\", VLOOKUP(K23,Projekte!C:D,2,FALSE))","v":""}]
[null,null,null,"","",null,"","","","",null,null,null,"","","",{"$f":"IF(K24=\"\", \"\", VLOOKUP(K24,Projekte!C:D,2,FALSE))","v":""}]
[null,null,null,"","",null,"","","","",null,null,null,"","","",{"$f":"IF(K25=\"\", \"\", VLOOKUP(K25,Projekte!C:D,2,FALSE))","v":""}]
[null,null,null,"","",null,"","","","",null,null,null,"","","",{"$f":"IF(K26=\"\", \"\", VLOOKUP(K26,Projekte!C:D,2,FALSE))","v":""}]
[null,null,null,"","",null,"","","","",null,null,null,"","","",{"$f":"IF(K27=\"\", \"\", VLOOKUP(K27,Projekte!C:D,2,FALSE))","v":""}]
[null,null,null,"","",null,"","","","",null,null,null,"","","",{"$f":"IF(K28=\"\", \"\", VLOOKUP(K28,Projekte!C:D,2,FALSE))","v":""}]
[null,null,null,"","",null,"","","","",null,null,null,"","","",{"$f":"IF(K29=\"\", \"\", VLOOKUP(K29,Projekte!C:D,2,FALSE))","v":""}]
[null,null,null,"","",null,"","","","",null,null,null,"","","",{"$f":"IF(K30=\"\", \"\", VLOOKUP(K30,Projekte!C:D,2,FALSE))","v":""}]
[null,null,null,"","",null,"","","","",null,null,null,"","","",{"$f":"IF(K31=\"\", \"\", VLOOKUP(K31,Projekte!C:D,2,FALSE))","v":""}]
[null,null,null,"","",null,"","","","",null,null,null,"","","",{"$f":"IF(K32=\"\", \"\", VLOOKUP(K32,Projekte!C:D,2,FALSE))","v":""}]
[null,null,null,"","",null,"","","","",null,null,null,"","","",{"$f":"IF(K33=\"\", \"\", VLOOKUP(K33,Projekte!C:D,2,FALSE))","v":""}]
[null,null,null,"","",null,"","","","",null,null,null,"","","",{"$f":"IF(K34=\"\", \"\", VLOOKUP(K34,Projekte!C:D,2,FALSE))","v":""}]
[null,null,null,"","",null,"","","","",null,null,null,"","","",{"$f":"IF(K35=\"\", \"\", VLOOKUP(K35,Projekte!C:D,2,FALSE))","v":""}]
[null,null,null,"","",null,{"$f":"IF(K36 = selectThisProjekt,E36, \"\")","v":""},"","","",null,null,null,"","","",{"$f":"IF(K36=\"\", \"\", VLOOKUP(K36,Projekte!C:D,2,FALSE))","v":""}]
[null,null,null,"","",null,"","","","",null,null,null,"","","",{"$f":"IF(K37=\"\", \"\", VLOOKUP(K37,Projekte!C:D,2,FALSE))","v":""}]
[null,null,null,"","",null,"","","","",null,null,null,"","","",{"$f":"IF(K38=\"\", \"\", VLOOKUP(K38,Projekte!C:D,2,FALSE))","v":""}]
[null,null,null,"","",null,"","","","",null,null,null,"","","",{"$f":"IF(K39=\"\", \"\", VLOOKUP(K39,Projekte!C:D,2,FALSE))","v":""}]
[null,null,null,"","",null,"","","","",null,null,null,"","","",{"$f":"IF(K40=\"\", \"\", VLOOKUP(K40,Projekte!C:D,2,FALSE))","v":""}]
[null,null,null,"","",null,"","","","",null,null,null,"","","",{"$f":"IF(K41=\"\", \"\", VLOOKUP(K41,Projekte!C:D,2,FALSE))","v":""}]
[null,null,null,"","",null,"","","","",null,null,null,"","","",{"$f":"IF(K42=\"\", \"\", VLOOKUP(K42,Projekte!C:D,2,FALSE))","v":""}]
[null,null,null,"","",null,"","","","",null,null,null,"","","",{"$f":"IF(K43=\"\", \"\", VLOOKUP(K43,Projekte!C:D,2,FALSE))","v":""}]
[null,null,null,"","",null,"","","","",null,null,null,"","","",{"$f":"IF(K44=\"\", \"\", VLOOKUP(K44,Projekte!C:D,2,FALSE))","v":""}]
[null,null,null,"","",null,"","","","",null,null,null,"","","",{"$f":"IF(K45=\"\", \"\", VLOOKUP(K45,Projekte!C:D,2,FALSE))","v":""}]
[null,null,null,"","",null,"","","","",null,null,null,"","","",{"$f":"IF(K46=\"\", \"\", VLOOKUP(K46,Projekte!C:D,2,FALSE))","v":""}]
[null,null,null,"","",null,"","","","",null,null,null,"","","",{"$f":"IF(K47=\"\", \"\", VLOOKUP(K47,Projekte!C:D,2,FALSE))","v":""}]
[null,null,null,"","",null,"","","","",null,null,null,"","","",{"$f":"IF(K48=\"\", \"\", VLOOKUP(K48,Projekte!C:D,2,FALSE))","v":""}]
[null,null,null,"","",null,"","","","",null,null,null,"","","",{"$f":"IF(K49=\"\", \"\", VLOOKUP(K49,Projekte!C:D,2,FALSE))","v":""}]
[null,null,null,"","",null,"","","","",null,null,null,"","","",{"$f":"IF(K50=\"\", \"\", VLOOKUP(K50,Projekte!C:D,2,FALSE))","v":""}]
[null,null,null,"","",null,"","","","",null,null,null,"","","",{"$f":"IF(K51=\"\", \"\", VLOOKUP(K51,Projekte!C:D,2,FALSE))","v":""}]
[null,null,null,"","",null,"","","","",null,null,null,"","","",{"$f":"IF(K52=\"\", \"\", VLOOKUP(K52,Projekte!C:D,2,FALSE))","v":""}]
[null,null,null,"","",null,"","","","",null,null,null,"","","",{"$f":"IF(K53=\"\", \"\", VLOOKUP(K53,Projekte!C:D,2,FALSE))","v":""}]
[null,null,null,"","",null,"","","","",null,null,null,"","","",{"$f":"IF(K54=\"\", \"\", VLOOKUP(K54,Projekte!C:D,2,FALSE))","v":""}]
[null,null,null,"","",null,"","","","",null,null,null,"","","",{"$f":"IF(K55=\"\", \"\", VLOOKUP(K55,Projekte!C:D,2,FALSE))","v":""}]
[null,null,null,"","",null,"","","","",null,null,null,"","","",{"$f":"IF(K56=\"\", \"\", VLOOKUP(K56,Projekte!C:D,2,FALSE))","v":""}]
[null,null,null,"","",null,"","","","",null,null,null,"","","",{"$f":"IF(K57=\"\", \"\", VLOOKUP(K57,Projekte!C:D,2,FALSE))","v":""}]
[null,null,null,"","",null,"","","","",null,null,null,"","","",{"$f":"IF(K58=\"\", \"\", VLOOKUP(K58,Projekte!C:D,2,FALSE))","v":""}]
[null,null,null,"","",null,"","","","",null,null,null,"","","",{"$f":"IF(K59=\"\", \"\", VLOOKUP(K59,Projekte!C:D,2,FALSE))","v":""}]
[null,null,null,"","",null,"","","","",null,null,null,"","","",{"$f":"IF(K60=\"\", \"\", VLOOKUP(K60,Projekte!C:D,2,FALSE))","v":""}]
[null,null,null,"","",null,"","","","",null,null,null,"","","",{"$f":"IF(K61=\"\", \"\", VLOOKUP(K61,Projekte!C:D,2,FALSE))","v":""}]
[null,null,null,"","",null,"","","","",null,null,null,"","","",{"$f":"IF(K62=\"\", \"\", VLOOKUP(K62,Projekte!C:D,2,FALSE))","v":""}]
[null,null,null,"","",null,"","","","",null,null,null,"","","",{"$f":"IF(K63=\"\", \"\", VLOOKUP(K63,Projekte!C:D,2,FALSE))","v":""}]
[null,null,null,"","",null,"","","","",null,null,null,"","","",{"$f":"IF(K64=\"\", \"\", VLOOKUP(K64,Projekte!C:D,2,FALSE))","v":""}]
[null,null,null,"","",null,"","","","",null,null,null,"","","",{"$f":"IF(K65=\"\", \"\", VLOOKUP(K65,Projekte!C:D,2,FALSE))","v":""}]
[null,null,null,"","",null,"","","","",null,null,null,"","","",{"$f":"IF(K66=\"\", \"\", VLOOKUP(K66,Projekte!C:D,2,FALSE))","v":""}]
[null,null,null,"","",null,"","","","",null,null,null,"","","",{"$f":"IF(K67=\"\", \"\", VLOOKUP(K67,Projekte!C:D,2,FALSE))","v":""}]
[null,null,null,{"$f":"IF(C68=\"\", \"\", C68-B68)","v":""},{"$f":"IF(D68=\"\", \"\", (C68-B68)*24)","v":""},null,{"$f":"IF(K68 = selectThisProjekt,E68, \"\")","v":""},"","","",null,null,null,"","","",{"$f":"IF(K68=\"\", \"\", VLOOKUP(K68,Projekte!C:D,2,FALSE))","v":""}]
[null,null,null,"","",null,"",{"$f":"IF(F69 = \"\", G69, \"\")","v":""},{"$f":"IF(LOWER(F69) = \"r\",G69,\"\")","v":""},{"$f":"IF(AND(F69<>\"\", LOWER(F69) <> \"r\"),G69,\"\")","v":""},null,null,null,"","","",{"$f":"IF(K69=\"\", \"\", VLOOKUP(K69,Projekte!C:D,2,FALSE))","v":""}]
[null,null,null,"","",null,"","","","",null,null,null,{"$f":"IF(M70<>\"\", \"\", IF(F70 = \"\", G70, \"\"))","v":""},{"$f":"IF(M70<>\"\", \"\", IF(LOWER(F70) = \"r\",G70,\"\"))","v":""},{"$f":"IF(M70<>\"\", \"\", IF(AND(F70<>\"\", LOWER(F70) <> \"r\"),G70,\"\"))","v":""},{"$f":"IF(K70=\"\", \"\", VLOOKUP(K70,Projekte!C:D,2,FALSE))","v":""}]
[null,null,null,"","",null,"","","","",null,null,null,"","","",{"$f":"IF(K71=\"\", \"\", VLOOKUP(K71,Projekte!C:D,2,FALSE))","v":""}]
[null,null,null,"","",null,"","","","",null,null,null,"","","",{"$f":"IF(K72=\"\", \"\", VLOOKUP(K72,Projekte!C:D,2,FALSE))","v":""}]
[null,null,null,"","",null,"","","","",null,null,null,"","","",{"$f":"IF(K73=\"\", \"\", VLOOKUP(K73,Projekte!C:D,2,FALSE))","v":""}]
[null,null,null,"","",null,"","","","",null,null,null,"","","",{"$f":"IF(K74=\"\", \"\", VLOOKUP(K74,Projekte!C:D,2,FALSE))","v":""}]
[null,null,null,"","",null,"","","","",null,null,null,"","","",{"$f":"IF(K75=\"\", \"\", VLOOKUP(K75,Projekte!C:D,2,FALSE))","v":""}]
[null,null,null,"","",null,"","","","",null,null,null,"","","",{"$f":"IF(K76=\"\", \"\", VLOOKUP(K76,Projekte!C:D,2,FALSE))","v":""}]
[null,null,null,"","",null,"","","","",null,null,null,"","","",{"$f":"IF(K77=\"\", \"\", VLOOKUP(K77,Projekte!C:D,2,FALSE))","v":""}]
[null,null,null,"","",null,"","","","",null,null,null,"","","",{"$f":"IF(K78=\"\", \"\", VLOOKUP(K78,Projekte!C:D,2,FALSE))","v":""}]
[null,null,null,"","",null,"","","","",null,null,null,"","","",{"$f":"IF(K79=\"\", \"\", VLOOKUP(K79,Projekte!C:D,2,FALSE))","v":""}]
[null,null,null,"","",null,"","","","",null,null,null,"","","",{"$f":"IF(K80=\"\", \"\", VLOOKUP(K80,Projekte!C:D,2,FALSE))","v":""}]
[null,null,null,"","",null,"","","","",null,null,null,"","","",{"$f":"IF(K81=\"\", \"\", VLOOKUP(K81,Projekte!C:D,2,FALSE))","v":""}]
[null,null,null,"","",null,"","","","",null,null,null,"","","",{"$f":"IF(K82=\"\", \"\", VLOOKUP(K82,Projekte!C:D,2,FALSE))","v":""}]
[null,null,null,"","",null,"","","","",null,null,null,"","","",{"$f":"IF(K83=\"\", \"\", VLOOKUP(K83,Projekte!C:D,2,FALSE))","v":""}]
[null,null,null,"","",null,"","","","",null,null,null,"","","",{"$f":"IF(K84=\"\", \"\", VLOOKUP(K84,Projekte!C:D,2,FALSE))","v":""}]
[null,null,null,"","",null,"","","","",null,null,null,"","","",{"$f":"IF(K85=\"\", \"\", VLOOKUP(K85,Projekte!C:D,2,FALSE))","v":""}]
[null,null,null,"","",null,"","","","",null,null,null,"","","",{"$f":"IF(K86=\"\", \"\", VLOOKUP(K86,Projekte!C:D,2,FALSE))","v":""}]
[null,null,null,"","",null,"","","","",null,null,null,"","","",{"$f":"IF(K87=\"\", \"\", VLOOKUP(K87,Projekte!C:D,2,FALSE))","v":""}]
[null,null,null,"","",null,"","","","",null,null,null,"","","",{"$f":"IF(K88=\"\", \"\", VLOOKUP(K88,Projekte!C:D,2,FALSE))","v":""}]
[null,null,null,"","",null,"","","","",null,null,null,"","","",{"$f":"IF(K89=\"\", \"\", VLOOKUP(K89,Projekte!C:D,2,FALSE))","v":""}]
[null,null,null,"","",null,"","","","",null,null,null,"","","",{"$f":"IF(K90=\"\", \"\", VLOOKUP(K90,Projekte!C:D,2,FALSE))","v":""}]
[null,null,null,"","",null,"","","","",null,null,null,"","","",{"$f":"IF(K91=\"\", \"\", VLOOKUP(K91,Projekte!C:D,2,FALSE))","v":""}]
[null,null,null,"","",null,"","","","",null,null,null,"","","",{"$f":"IF(K92=\"\", \"\", VLOOKUP(K92,Projekte!C:D,2,FALSE))","v":""}]
[null,null,null,"","",null,"","","","",null,null,null,"","","",{"$f":"IF(K93=\"\", \"\", VLOOKUP(K93,Projekte!C:D,2,FALSE))","v":""}]
[null,null,null,"","",null,"","","","",null,null,null,"","","",{"$f":"IF(K94=\"\", \"\", VLOOKUP(K94,Projekte!C:D,2,FALSE))","v":""}]
[null,null,null,"","",null,"","","","",null,null,null,"","","",{"$f":"IF(K95=\"\", \"\", VLOOKUP(K95,Projekte!C:D,2,FALSE))","v":""}]
[null,null,null,"","",null,"","","","",null,null,null,"","","",{"$f":"IF(K96=\"\", \"\", VLOOKUP(K96,Projekte!C:D,2,FALSE))","v":""}]
[null,null,null,"","",null,"","","","",null,null,null,"","","",{"$f":"IF(K97=\"\", \"\", VLOOKUP(K97,Projekte!C:D,2,FALSE))","v":""}]
[null,null,null,"","",null,"","","","",null,null,null,"","","",{"$f":"IF(K98=\"\", \"\", VLOOKUP(K98,Projekte!C:D,2,FALSE))","v":""}]
[null,null,null,"","",null,"","","","",null,null,null,"","","",{"$f":"IF(K99=\"\", \"\", VLOOKUP(K99,Projekte!C:D,2,FALSE))","v":""}]
[null,null,null,"","",null,{"$f":"IF(K100 = selectThisProjekt,E100, \"\")","v":""},"","","",null,null,null,"","","",{"$f":"IF(K100=\"\", \"\", VLOOKUP(K100,Projekte!C:D,2,FALSE))","v":""}]
[null,null,null,"","",null,"","","","",null,null,null,"","","",{"$f":"IF(K101=\"\", \"\", VLOOKUP(K101,Projekte!C:D,2,FALSE))","v":""}]
[null,null,null,"","",null,"","","","",null,null,null,"","","",{"$f":"IF(K102=\"\", \"\", VLOOKUP(K102,Projekte!C:D,2,FALSE))","v":""}]
[null,null,null,"","",null,"","","","",null,null,null,"","","",{"$f":"IF(K103=\"\", \"\", VLOOKUP(K103,Projekte!C:D,2,FALSE))","v":""}]
[null,null,null,"","",null,"","","","",null,null,null,"","","",{"$f":"IF(K104=\"\", \"\", VLOOKUP(K104,Projekte!C:D,2,FALSE))","v":""}]
[null,null,null,"","",null,"","","","",null,null,null,"","","",{"$f":"IF(K105=\"\", \"\", VLOOKUP(K105,Projekte!C:D,2,FALSE))","v":""}]
[null,null,null,"","",null,"","","","",null,null,null,"","","",{"$f":"IF(K106=\"\", \"\", VLOOKUP(K106,Projekte!C:D,2,FALSE))","v":""}]
[null,null,null,"","",null,"","","","",null,null,null,"","","",{"$f":"IF(K107=\"\", \"\", VLOOKUP(K107,Projekte!C:D,2,FALSE))","v":""}]
[null,null,null,"","",null,"","","","",null,null,null,"","","",{"$f":"IF(K108=\"\", \"\", VLOOKUP(K108,Projekte!C:D,2,FALSE))","v":""}]
[null,null,null,"","",null,"","","","",null,null,null,"","","",{"$f":"IF(K109=\"\", \"\", VLOOKUP(K109,Projekte!C:D,2,FALSE))","v":""}]
[null,null,null,"","",null,"","","","",null,null,null,"","","",{"$f":"IF(K110=\"\", \"\", VLOOKUP(K110,Projekte!C:D,2,FALSE))","v":""}]
[null,null,null,"","",null,"","","","",null,null,null,"","","",{"$f":"IF(K111=\"\", \"\", VLOOKUP(K111,Projekte!C:D,2,FALSE))","v":""}]
[null,null,null,"","",null,"","","","",null,null,null,"","","",{"$f":"IF(K112=\"\", \"\", VLOOKUP(K112,Projekte!C:D,2,FALSE))","v":""}]
[null,null,null,"","",null,"","","","",null,null,null,"","","",{"$f":"IF(K113=\"\", \"\", VLOOKUP(K113,Projekte!C:D,2,FALSE))","v":""}]
[null,null,null,"","",null,"","","","",null,null,null,"","","",{"$f":"IF(K114=\"\", \"\", VLOOKUP(K114,Projekte!C:D,2,FALSE))","v":""}]
[null,null,null,"","",null,"","","","",null,null,null,"","","",{"$f":"IF(K115=\"\", \"\", VLOOKUP(K115,Projekte!C:D,2,FALSE))","v":""}]
[null,null,null,"","",null,"","","","",null,null,null,"","","",{"$f":"IF(K116=\"\", \"\", VLOOKUP(K116,Projekte!C:D,2,FALSE))","v":""}]
[null,null,null,"","",null,"","","","",null,null,null,"","","",{"$f":"IF(K117=\"\", \"\", VLOOKUP(K117,Projekte!C:D,2,FALSE))","v":""}]
[null,null,null,"","",null,"","","","",null,null,null,"","","",{"$f":"IF(K118=\"\", \"\", VLOOKUP(K118,Projekte!C:D,2,FALSE))","v":""}]
[null,null,null,"","",null,"","","","",null,null,null,"","","",{"$f":"IF(K119=\"\", \"\", VLOOKUP(K119,Projekte!C:D,2,FALSE))","v":""}]
[null,null,null,"","",null,"","","","",null,null,null,"","","",{"$f":"IF(K120=\"\", \"\", VLOOKUP(K120,Projekte!C:D,2,FALSE))","v":""}]
[null,null,null,"","",null,"","","","",null,null,null,"","","",{"$f":"IF(K121=\"\", \"\", VLOOKUP(K121,Projekte!C:D,2,FALSE))","v":""}]
[null,null,null,"","",null,"","","","",null,null,null,"","","",{"$f":"IF(K122=\"\", \"\", VLOOKUP(K122,Projekte!C:D,2,FALSE))","v":""}]
[null,null,null,"","",null,{"$f":"IF(K123 = selectThisProjekt,E123, \"\")","v":""},"","","",null,null,null,"","","",{"$f":"IF(K123=\"\", \"\", VLOOKUP(K123,Projekte!C:D,2,FALSE))","v":""}]
[null,null,null,"","",null,"","","","",null,null,null,"","","",{"$f":"IF(K124=\"\", \"\", VLOOKUP(K124,Projekte!C:D,2,FALSE))","v":""}]
[null,null,null,"","",null,{"$f":"IF(K125 = selectThisProjekt,E125, \"\")","v":""},"","","",null,null,null,"","","",{"$f":"IF(K125=\"\", \"\", VLOOKUP(K125,Projekte!C:D,2,FALSE))","v":""}]
[null,null,null,"","",null,"","","","",null,null,null,"","","",{"$f":"IF(K126=\"\", \"\", VLOOKUP(K126,Projekte!C:D,2,FALSE))","v":""}]
[null,null,null,"","",null,"","","","",null,null,null,"","","",{"$f":"IF(K127=\"\", \"\", VLOOKUP(K127,Projekte!C:D,2,FALSE))","v":""}]
[null,null,null,"","",null,"","","","",null,null,null,"","","",{"$f":"IF(K128=\"\", \"\", VLOOKUP(K128,Projekte!C:D,2,FALSE))","v":""}]
[null,null,null,"","",null,"","","","",null,null,null,"","","",{"$f":"IF(K129=\"\", \"\", VLOOKUP(K129,Projekte!C:D,2,FALSE))","v":""}]
[null,null,null,"","",null,"","","","",null,null,null,"","","",{"$f":"IF(K130=\"\", \"\", VLOOKUP(K130,Projekte!C:D,2,FALSE))","v":""}]
[null,null,null,"","",null,"","","","",null,null,null,"","","",{"$f":"IF(K131=\"\", \"\", VLOOKUP(K131,Projekte!C:D,2,FALSE))","v":""}]
[null,null,null,{"$f":"IF(C132=\"\", \"\", C132-B132)","v":""},{"$f":"IF(D132=\"\", \"\", (C132-B132)*24)","v":""},null,{"$f":"IF(K132 = selectThisProjekt,E132, \"\")","v":""},"","","",null,null,null,"","","",{"$f":"IF(K132=\"\", \"\", VLOOKUP(K132,Projekte!C:D,2,FALSE))","v":""}]
[null,null,null,"","",null,"",{"$f":"IF(F133 = \"\", G133, \"\")","v":""},{"$f":"IF(LOWER(F133) = \"r\",G133,\"\")","v":""},{"$f":"IF(AND(F133<>\"\", LOWER(F133) <> \"r\"),G133,\"\")","v":""},null,null,null,"","","",{"$f":"IF(K133=\"\", \"\", VLOOKUP(K133,Projekte!C:D,2,FALSE))","v":""}]
[null,null,null,"","",null,"","","","",null,null,null,{"$f":"IF(M134<>\"\", \"\", IF(F134 = \"\", G134, \"\"))","v":""},{"$f":"IF(M134<>\"\", \"\", IF(LOWER(F134) = \"r\",G134,\"\"))","v":""},{"$f":"IF(M134<>\"\", \"\", IF(AND(F134<>\"\", LOWER(F134) <> \"r\"),G134,\"\"))","v":""},{"$f":"IF(K134=\"\", \"\", VLOOKUP(K134,Projekte!C:D,2,FALSE))","v":""}]
[null,null,null,"","",null,"","","","",null,null,null,"","","",{"$f":"IF(K135=\"\", \"\", VLOOKUP(K135,Projekte!C:D,2,FALSE))","v":""}]
[null,null,null,"","",null,"","","","",null,null,null,"","","",{"$f":"IF(K136=\"\", \"\", VLOOKUP(K136,Projekte!C:D,2,FALSE))","v":""}]
[null,null,null,"","",null,"","","","",null,null,null,"","","",{"$f":"IF(K137=\"\", \"\", VLOOKUP(K137,Projekte!C:D,2,FALSE))","v":""}]
[null,null,null,"","",null,"","","","",null,null,null,"","","",{"$f":"IF(K138=\"\", \"\", VLOOKUP(K138,Projekte!C:D,2,FALSE))","v":""}]
[null,null,null,"","",null,"","","","",null,null,null,"","","",{"$f":"IF(K139=\"\", \"\", VLOOKUP(K139,Projekte!C:D,2,FALSE))","v":""}]
[null,null,null,"","",null,"","","","",null,null,null,"","","",{"$f":"IF(K140=\"\", \"\", VLOOKUP(K140,Projekte!C:D,2,FALSE))","v":""}]
[null,null,null,"","",null,"","","","",null,null,null,"","","",{"$f":"IF(K141=\"\", \"\", VLOOKUP(K141,Projekte!C:D,2,FALSE))","v":""}]
[null,null,null,"","",null,"","","","",null,null,null,"","","",{"$f":"IF(K142=\"\", \"\", VLOOKUP(K142,Projekte!C:D,2,FALSE))","v":""}]
[null,null,null,"","",null,"","","","",null,null,null,"","","",{"$f":"IF(K143=\"\", \"\", VLOOKUP(K143,Projekte!C:D,2,FALSE))","v":""}]
[null,null,null,"","",null,"","","","",null,null,null,"","","",{"$f":"IF(K144=\"\", \"\", VLOOKUP(K144,Projekte!C:D,2,FALSE))","v":""}]
[null,null,null,"","",null,"","","","",null,null,null,"","","",{"$f":"IF(K145=\"\", \"\", VLOOKUP(K145,Projekte!C:D,2,FALSE))","v":""}]
[null,null,null,"","",null,"","","","",null,null,null,"","","",{"$f":"IF(K146=\"\", \"\", VLOOKUP(K146,Projekte!C:D,2,FALSE))","v":""}]
[null,null,null,"","",null,"","","","",null,null,null,"","","",{"$f":"IF(K147=\"\", \"\", VLOOKUP(K147,Projekte!C:D,2,FALSE))","v":""}]
[null,null,null,"","",null,"","","","",null,null,null,"","","",{"$f":"IF(K148=\"\", \"\", VLOOKUP(K148,Projekte!C:D,2,FALSE))","v":""}]
[null,null,null,"","",null,"","","","",null,null,null,"","","",{"$f":"IF(K149=\"\", \"\", VLOOKUP(K149,Projekte!C:D,2,FALSE))","v":""}]
[null,null,null,"","",null,"","","","",null,null,null,"","","",{"$f":"IF(K150=\"\", \"\", VLOOKUP(K150,Projekte!C:D,2,FALSE))","v":""}]
[null,null,null,"","",null,"","","","",null,null,null,"","","",{"$f":"IF(K151=\"\", \"\", VLOOKUP(K151,Projekte!C:D,2,FALSE))","v":""}]
[null,null,null,"","",null,"","","","",null,null,null,"","","",{"$f":"IF(K152=\"\", \"\", VLOOKUP(K152,Projekte!C:D,2,FALSE))","v":""}]
[null,null,null,"","",null,"","","","",null,null,null,"","","",{"$f":"IF(K153=\"\", \"\", VLOOKUP(K153,Projekte!C:D,2,FALSE))","v":""}]
[null,null,null,"","",null,"","","","",null,null,null,"","","",{"$f":"IF(K154=\"\", \"\", VLOOKUP(K154,Projekte!C:D,2,FALSE))","v":""}]
[null,null,null,"","",null,"","","","",null,null,null,"","","",{"$f":"IF(K155=\"\", \"\", VLOOKUP(K155,Projekte!C:D,2,FALSE))","v":""}]
[null,null,null,"","",null,"","","","",null,null,null,"","","",{"$f":"IF(K156=\"\", \"\", VLOOKUP(K156,Projekte!C:D,2,FALSE))","v":""}]
[null,null,null,"","",null,"","","","",null,null,null,"","","",{"$f":"IF(K157=\"\", \"\", VLOOKUP(K157,Projekte!C:D,2,FALSE))","v":""}]
[null,null,null,"","",null,"","","","",null,null,null,"","","",{"$f":"IF(K158=\"\", \"\", VLOOKUP(K158,Projekte!C:D,2,FALSE))","v":""}]
[null,null,null,"","",null,"","","","",null,null,null,"","","",{"$f":"IF(K159=\"\", \"\", VLOOKUP(K159,Projekte!C:D,2,FALSE))","v":""}]
[null,null,null,"","",null,"","","","",null,null,null,"","","",{"$f":"IF(K160=\"\", \"\", VLOOKUP(K160,Projekte!C:D,2,FALSE))","v":""}]
[null,null,null,"","",null,"","","","",null,null,null,"","","",{"$f":"IF(K161=\"\", \"\", VLOOKUP(K161,Projekte!C:D,2,FALSE))","v":""}]
[null,null,null,"","",null,"","","","",null,null,null,"","","",{"$f":"IF(K162=\"\", \"\", VLOOKUP(K162,Projekte!C:D,2,FALSE))","v":""}]
[null,null,null,"","",null,"","","","",null,null,null,"","","",{"$f":"IF(K163=\"\", \"\", VLOOKUP(K163,Projekte!C:D,2,FALSE))","v":""}]
[null,null,null,"","",null,{"$f":"IF(K164 = selectThisProjekt,E164, \"\")","v":""},"","","",null,null,null,"","","",{"$f":"IF(K164=\"\", \"\", VLOOKUP(K164,Projekte!C:D,2,FALSE))","v":""}]
[null,null,null,"","",null,"","","","",null,null,null,"","","",{"$f":"IF(K165=\"\", \"\", VLOOKUP(K165,Projekte!C:D,2,FALSE))","v":""}]
[null,null,null,"","",null,"","","","",null,null,null,"","","",{"$f":"IF(K166=\"\", \"\", VLOOKUP(K166,Projekte!C:D,2,FALSE))","v":""}]
[null,null,null,"","",null,"","","","",null,null,null,"","","",{"$f":"IF(K167=\"\", \"\", VLOOKUP(K167,Projekte!C:D,2,FALSE))","v":""}]
[null,null,null,"","",null,"","","","",null,null,null,"","","",{"$f":"IF(K168=\"\", \"\", VLOOKUP(K168,Projekte!C:D,2,FALSE))","v":""}]
[null,null,null,"","",null,"","","","",null,null,null,"","","",{"$f":"IF(K169=\"\", \"\", VLOOKUP(K169,Projekte!C:D,2,FALSE))","v":""}]
[null,null,null,"","",null,{"$f":"IF(K170 = selectThisProjekt,E170, \"\")","v":""},"","","",null,null,null,"","","",{"$f":"IF(K170=\"\", \"\", VLOOKUP(K170,Projekte!C:D,2,FALSE))","v":""}]
[null,null,null,"","",null,"","","","",null,null,null,"","","",{"$f":"IF(K171=\"\", \"\", VLOOKUP(K171,Projekte!C:D,2,FALSE))","v":""}]
[null,null,null,"","",null,"","","","",null,null,null,"","","",{"$f":"IF(K172=\"\", \"\", VLOOKUP(K172,Projekte!C:D,2,FALSE))","v":""}]
[null,null,null,"","",null,"","","","",null,null,null,"","","",{"$f":"IF(K173=\"\", \"\", VLOOKUP(K173,Projekte!C:D,2,FALSE))","v":""}]
[null,null,null,"","",null,"","","","",null,null,null,"","","",{"$f":"IF(K174=\"\", \"\", VLOOKUP(K174,Projekte!C:D,2,FALSE))","v":""}]
[null,null,null,"","",null,"","","","",null,null,null,"","","",{"$f":"IF(K175=\"\", \"\", VLOOKUP(K175,Projekte!C:D,2,FALSE))","v":""}]
[null,null,null,"","",null,"","","","",null,null,null,"","","",{"$f":"IF(K176=\"\", \"\", VLOOKUP(K176,Projekte!C:D,2,FALSE))","v":""}]
[null,null,null,"","",null,"","","","",null,null,null,"","","",{"$f":"IF(K177=\"\", \"\", VLOOKUP(K177,Projekte!C:D,2,FALSE))","v":""}]
[null,null,null,"","",null,"","","","",null,null,null,"","","",{"$f":"IF(K178=\"\", \"\", VLOOKUP(K178,Projekte!C:D,2,FALSE))","v":""}]
[null,null,null,"","",null,"","","","",null,null,null,"","","",{"$f":"IF(K179=\"\", \"\", VLOOKUP(K179,Projekte!C:D,2,FALSE))","v":""}]
[null,null,null,"","",null,"","","","",null,null,null,"","","",{"$f":"IF(K180=\"\", \"\", VLOOKUP(K180,Projekte!C:D,2,FALSE))","v":""}]
[null,null,null,"","",null,"","","","",null,null,null,"","","",{"$f":"IF(K181=\"\", \"\", VLOOKUP(K181,Projekte!C:D,2,FALSE))","v":""}]
[null,null,null,"","",null,"","","","",null,null,null,"","","",{"$f":"IF(K182=\"\", \"\", VLOOKUP(K182,Projekte!C:D,2,FALSE))","v":""}]
[null,null,null,"","",null,"","","","",null,null,null,"","","",{"$f":"IF(K183=\"\", \"\", VLOOKUP(K183,Projekte!C:D,2,FALSE))","v":""}]
[null,null,null,"","",null,"","","","",null,null,null,"","","",{"$f":"IF(K184=\"\", \"\", VLOOKUP(K184,Projekte!C:D,2,FALSE))","v":""}]
[null,null,null,"","",null,"","","","",null,null,null,"","","",{"$f":"IF(K185=\"\", \"\", VLOOKUP(K185,Projekte!C:D,2,FALSE))","v":""}]
[null,null,null,"","",null,"","","","",null,null,null,"","","",{"$f":"IF(K186=\"\", \"\", VLOOKUP(K186,Projekte!C:D,2,FALSE))","v":""}]
[null,null,null,"","",null,"","","","",null,null,null,"","","",{"$f":"IF(K187=\"\", \"\", VLOOKUP(K187,Projekte!C:D,2,FALSE))","v":""}]
[null,null,null,"","",null,"","","","",null,null,null,"","","",{"$f":"IF(K188=\"\", \"\", VLOOKUP(K188,Projekte!C:D,2,FALSE))","v":""}]
[null,null,null,"","",null,"","","","",null,null,null,"","","",{"$f":"IF(K189=\"\", \"\", VLOOKUP(K189,Projekte!C:D,2,FALSE))","v":""}]
[null,null,null,"","",null,"","","","",null,null,null,"","","",{"$f":"IF(K190=\"\", \"\", VLOOKUP(K190,Projekte!C:D,2,FALSE))","v":""}]
[null,null,null,"","",null,"","","","",null,null,null,"","","",{"$f":"IF(K191=\"\", \"\", VLOOKUP(K191,Projekte!C:D,2,FALSE))","v":""}]
[null,null,null,"","",null,"","","","",null,null,null,"","","",{"$f":"IF(K192=\"\", \"\", VLOOKUP(K192,Projekte!C:D,2,FALSE))","v":""}]
[null,null,null,"","",null,"","","","",null,null,null,"","","",{"$f":"IF(K193=\"\", \"\", VLOOKUP(K193,Projekte!C:D,2,FALSE))","v":""}]
[null,null,null,"","",null,"","","","",null,null,null,"","","",{"$f":"IF(K194=\"\", \"\", VLOOKUP(K194,Projekte!C:D,2,FALSE))","v":""}]
[null,null,null,"","",null,"","","","",null,null,null,"","","",{"$f":"IF(K195=\"\", \"\", VLOOKUP(K195,Projekte!C:D,2,FALSE))","v":""}]
[null,null,null,"","",null,"","","","",null,null,null,"","","",{"$f":"IF(K196=\"\", \"\", VLOOKUP(K196,Projekte!C:D,2,FALSE))","v":""}]
[null,null,null,"","",null,"","","","",null,null,null,"","","",{"$f":"IF(K197=\"\", \"\", VLOOKUP(K197,Projekte!C:D,2,FALSE))","v":""}]
[null,null,null,"","",null,"","","","",null,null,null,{"$f":"IF(M198<>\"\", \"\", IF(F198 = \"\", G198, \"\"))","v":""},{"$f":"IF(M198<>\"\", \"\", IF(LOWER(F198) = \"r\",G198,\"\"))","v":""},{"$f":"IF(M198<>\"\", \"\", IF(AND(F198<>\"\", LOWER(F198) <> \"r\"),G198,\"\"))","v":""},{"$f":"IF(K198=\"\", \"\", VLOOKUP(K198,Projekte!C:D,2,FALSE))","v":""}]
[null,null,null,"","",null,"","","","",null,null,null,"","","",{"$f":"IF(K199=\"\", \"\", VLOOKUP(K199,Projekte!C:D,2,FALSE))","v":""}]
[null,null,null,"","",null,"","","","",null,null,null,"","","",{"$f":"IF(K200=\"\", \"\", VLOOKUP(K200,Projekte!C:D,2,FALSE))","v":""}]
[null,null,null,"","",null,"","","","",null,null,null,"","","",{"$f":"IF(K201=\"\", \"\", VLOOKUP(K201,Projekte!C:D,2,FALSE))","v":""}]
[null,null,null,"","",null,"","","","",null,null,null,"","","",{"$f":"IF(K202=\"\", \"\", VLOOKUP(K202,Projekte!C:D,2,FALSE))","v":""}]
[null,null,null,"","",null,{"$f":"IF(K203 = selectThisProjekt,E203, \"\")","v":""},"","","",null,null,null,"","","",{"$f":"IF(K203=\"\", \"\", VLOOKUP(K203,Projekte!C:D,2,FALSE))","v":""}]
[null,null,null,"<Ende Formeln>"]

{"sheet":"Dez","index":12,"n_rows":204,"n_cols":17,"rows_kept":204,"cut":false,"hidden":false,"merged":[[0,13,0,15],[2,0,2,2]]}
[null,null,"DL-Zeiten von",{"$f":"AssignedToCfg","v":{"$error":"#REF!"}},null,null,null,null,null,null,null,null,null,"Faktura nicht erfasst"]
["Datum","Beginn","Ende","h","h,xx","r: Reise, \nx: nicht berechnen","Summe","Dienstleistung","Reise","nicht berechnen",null,"Tätigkeit","Faktura erfasst","Dienstleistung","Reise","nicht berechnen","Projektname"]
[null,null,null,null,null,"Summe",{"$f":"SUM(G4:G203)","v":0},{"$f":"SUM(H4:H203)","v":0},{"$f":"SUM(I4:I203)","v":0},{"$f":"SUM(J4:J203)","v":0},null,"<- für diesen ProjektBereich",null,{"$f":"SUM(N4:N203)","v":0},{"$f":"SUM(O4:O203)","v":0},{"$f":"SUM(P4:P203)","v":0}]
[null,null,null,{"$f":"IF(C4=\"\", \"\", C4-B4)","v":""},{"$f":"IF(D4=\"\", \"\", (C4-B4)*24)","v":""},null,{"$f":"IF(K4 = selectThisProjekt,E4, \"\")","v":""},{"$f":"IF(F4 = \"\", G4, \"\")","v":""},{"$f":"IF(LOWER(F4) = \"r\",G4,\"\")","v":""},{"$f":"IF(AND(F4<>\"\", LOWER(F4) <> \"r\"),G4,\"\")","v":""},null,null,null,{"$f":"IF(M4<>\"\", \"\", IF(F4 = \"\", G4, \"\"))","v":""},{"$f":"IF(M4<>\"\", \"\", IF(LOWER(F4) = \"r\",G4,\"\"))","v":""},{"$f":"IF(M4<>\"\", \"\", IF(AND(F4<>\"\", LOWER(F4) <> \"r\"),G4,\"\"))","v":""},{"$f":"IF(K4=\"\", \"\", VLOOKUP(K4,Projekte!C:D,2,FALSE))","v":""}]
[null,null,null,"","",null,"",{"$f":"IF(F5 = \"\", G5, \"\")","v":""},{"$f":"IF(LOWER(F5) = \"r\",G5,\"\")","v":""},{"$f":"IF(AND(F5<>\"\", LOWER(F5) <> \"r\"),G5,\"\")","v":""},null,null,null,{"$f":"IF(M5<>\"\", \"\", IF(F5 = \"\", G5, \"\"))","v":""},{"$f":"IF(M5<>\"\", \"\", IF(LOWER(F5) = \"r\",G5,\"\"))","v":""},{"$f":"IF(M5<>\"\", \"\", IF(AND(F5<>\"\", LOWER(F5) <> \"r\"),G5,\"\"))","v":""},{"$f":"IF(K5=\"\", \"\", VLOOKUP(K5,Projekte!C:D,2,FALSE))","v":""}]
[null,null,null,"","",null,"","","","",null,null,null,{"$f":"IF(M6<>\"\", \"\", IF(F6 = \"\", G6, \"\"))","v":""},{"$f":"IF(M6<>\"\", \"\", IF(LOWER(F6) = \"r\",G6,\"\"))","v":""},{"$f":"IF(M6<>\"\", \"\", IF(AND(F6<>\"\", LOWER(F6) <> \"r\"),G6,\"\"))","v":""},{"$f":"IF(K6=\"\", \"\", VLOOKUP(K6,Projekte!C:D,2,FALSE))","v":""}]
[null,null,null,"","",null,"","","","",null,null,null,"","","",{"$f":"IF(K7=\"\", \"\", VLOOKUP(K7,Projekte!C:D,2,FALSE))","v":""}]
[null,null,null,"","",null,"","","","",null,null,null,"","","",{"$f":"IF(K8=\"\", \"\", VLOOKUP(K8,Projekte!C:D,2,FALSE))","v":""}]
[null,null,null,"","",null,"","","","",null,null,null,"","","",{"$f":"IF(K9=\"\", \"\", VLOOKUP(K9,Projekte!C:D,2,FALSE))","v":""}]
[null,null,null,"","",null,"","","","",null,null,null,"","","",{"$f":"IF(K10=\"\", \"\", VLOOKUP(K10,Projekte!C:D,2,FALSE))","v":""}]
[null,null,null,"","",null,"","","","",null,null,null,"","","",{"$f":"IF(K11=\"\", \"\", VLOOKUP(K11,Projekte!C:D,2,FALSE))","v":""}]
[null,null,null,"","",null,"","","","",null,null,null,"","","",{"$f":"IF(K12=\"\", \"\", VLOOKUP(K12,Projekte!C:D,2,FALSE))","v":""}]
[null,null,null,"","",null,"","","","",null,null,null,"","","",{"$f":"IF(K13=\"\", \"\", VLOOKUP(K13,Projekte!C:D,2,FALSE))","v":""}]
[null,null,null,"","",null,"","","","",null,null,null,"","","",{"$f":"IF(K14=\"\", \"\", VLOOKUP(K14,Projekte!C:D,2,FALSE))","v":""}]
[null,null,null,"","",null,"","","","",null,null,null,"","","",{"$f":"IF(K15=\"\", \"\", VLOOKUP(K15,Projekte!C:D,2,FALSE))","v":""}]
[null,null,null,"","",null,"","","","",null,null,null,"","","",{"$f":"IF(K16=\"\", \"\", VLOOKUP(K16,Projekte!C:D,2,FALSE))","v":""}]
[null,null,null,"","",null,"","","","",null,null,null,"","","",{"$f":"IF(K17=\"\", \"\", VLOOKUP(K17,Projekte!C:D,2,FALSE))","v":""}]
[null,null,null,"","",null,"","","","",null,null,null,"","","",{"$f":"IF(K18=\"\", \"\", VLOOKUP(K18,Projekte!C:D,2,FALSE))","v":""}]
[null,null,null,"","",null,"","","","",null,null,null,"","","",{"$f":"IF(K19=\"\", \"\", VLOOKUP(K19,Projekte!C:D,2,FALSE))","v":""}]
[null,null,null,"","",null,"","","","",null,null,null,"","","",{"$f":"IF(K20=\"\", \"\", VLOOKUP(K20,Projekte!C:D,2,FALSE))","v":""}]
[null,null,null,"","",null,"","","","",null,null,null,"","","",{"$f":"IF(K21=\"\", \"\", VLOOKUP(K21,Projekte!C:D,2,FALSE))","v":""}]
[null,null,null,"","",null,"","","","",null,null,null,"","","",{"$f":"IF(K22=\"\", \"\", VLOOKUP(K22,Projekte!C:D,2,FALSE))","v":""}]
[null,null,null,"","",null,"","","","",null,null,null,"","","",{"$f":"IF(K23=\"\", \"\", VLOOKUP(K23,Projekte!C:D,2,FALSE))","v":""}]
[null,null,null,"","",null,"","","","",null,null,null,"","","",{"$f":"IF(K24=\"\", \"\", VLOOKUP(K24,Projekte!C:D,2,FALSE))","v":""}]
[null,null,null,"","",null,"","","","",null,null,null,"","","",{"$f":"IF(K25=\"\", \"\", VLOOKUP(K25,Projekte!C:D,2,FALSE))","v":""}]
[null,null,null,"","",null,"","","","",null,null,null,"","","",{"$f":"IF(K26=\"\", \"\", VLOOKUP(K26,Projekte!C:D,2,FALSE))","v":""}]
[null,null,null,"","",null,"","","","",null,null,null,"","","",{"$f":"IF(K27=\"\", \"\", VLOOKUP(K27,Projekte!C:D,2,FALSE))","v":""}]
[null,null,null,"","",null,"","","","",null,null,null,"","","",{"$f":"IF(K28=\"\", \"\", VLOOKUP(K28,Projekte!C:D,2,FALSE))","v":""}]
[null,null,null,"","",null,"","","","",null,null,null,"","","",{"$f":"IF(K29=\"\", \"\", VLOOKUP(K29,Projekte!C:D,2,FALSE))","v":""}]
[null,null,null,"","",null,"","","","",null,null,null,"","","",{"$f":"IF(K30=\"\", \"\", VLOOKUP(K30,Projekte!C:D,2,FALSE))","v":""}]
[null,null,null,"","",null,"","","","",null,null,null,"","","",{"$f":"IF(K31=\"\", \"\", VLOOKUP(K31,Projekte!C:D,2,FALSE))","v":""}]
[null,null,null,"","",null,"","","","",null,null,null,"","","",{"$f":"IF(K32=\"\", \"\", VLOOKUP(K32,Projekte!C:D,2,FALSE))","v":""}]
[null,null,null,"","",null,"","","","",null,null,null,"","","",{"$f":"IF(K33=\"\", \"\", VLOOKUP(K33,Projekte!C:D,2,FALSE))","v":""}]
[null,null,null,"","",null,"","","","",null,null,null,"","","",{"$f":"IF(K34=\"\", \"\", VLOOKUP(K34,Projekte!C:D,2,FALSE))","v":""}]
[null,null,null,"","",null,"","","","",null,null,null,"","","",{"$f":"IF(K35=\"\", \"\", VLOOKUP(K35,Projekte!C:D,2,FALSE))","v":""}]
[null,null,null,"","",null,{"$f":"IF(K36 = selectThisProjekt,E36, \"\")","v":""},"","","",null,null,null,"","","",{"$f":"IF(K36=\"\", \"\", VLOOKUP(K36,Projekte!C:D,2,FALSE))","v":""}]
[null,null,null,"","",null,"","","","",null,null,null,"","","",{"$f":"IF(K37=\"\", \"\", VLOOKUP(K37,Projekte!C:D,2,FALSE))","v":""}]
[null,null,null,"","",null,"","","","",null,null,null,"","","",{"$f":"IF(K38=\"\", \"\", VLOOKUP(K38,Projekte!C:D,2,FALSE))","v":""}]
[null,null,null,"","",null,"","","","",null,null,null,"","","",{"$f":"IF(K39=\"\", \"\", VLOOKUP(K39,Projekte!C:D,2,FALSE))","v":""}]
[null,null,null,"","",null,"","","","",null,null,null,"","","",{"$f":"IF(K40=\"\", \"\", VLOOKUP(K40,Projekte!C:D,2,FALSE))","v":""}]
[null,null,null,"","",null,"","","","",null,null,null,"","","",{"$f":"IF(K41=\"\", \"\", VLOOKUP(K41,Projekte!C:D,2,FALSE))","v":""}]
[null,null,null,"","",null,"","","","",null,null,null,"","","",{"$f":"IF(K42=\"\", \"\", VLOOKUP(K42,Projekte!C:D,2,FALSE))","v":""}]
[null,null,null,"","",null,"","","","",null,null,null,"","","",{"$f":"IF(K43=\"\", \"\", VLOOKUP(K43,Projekte!C:D,2,FALSE))","v":""}]
[null,null,null,"","",null,"","","","",null,null,null,"","","",{"$f":"IF(K44=\"\", \"\", VLOOKUP(K44,Projekte!C:D,2,FALSE))","v":""}]
[null,null,null,"","",null,"","","","",null,null,null,"","","",{"$f":"IF(K45=\"\", \"\", VLOOKUP(K45,Projekte!C:D,2,FALSE))","v":""}]
[null,null,null,"","",null,"","","","",null,null,null,"","","",{"$f":"IF(K46=\"\", \"\", VLOOKUP(K46,Projekte!C:D,2,FALSE))","v":""}]
[null,null,null,"","",null,"","","","",null,null,null,"","","",{"$f":"IF(K47=\"\", \"\", VLOOKUP(K47,Projekte!C:D,2,FALSE))","v":""}]
[null,null,null,"","",null,"","","","",null,null,null,"","","",{"$f":"IF(K48=\"\", \"\", VLOOKUP(K48,Projekte!C:D,2,FALSE))","v":""}]
[null,null,null,"","",null,"","","","",null,null,null,"","","",{"$f":"IF(K49=\"\", \"\", VLOOKUP(K49,Projekte!C:D,2,FALSE))","v":""}]
[null,null,null,"","",null,"","","","",null,null,null,"","","",{"$f":"IF(K50=\"\", \"\", VLOOKUP(K50,Projekte!C:D,2,FALSE))","v":""}]
[null,null,null,"","",null,"","","","",null,null,null,"","","",{"$f":"IF(K51=\"\", \"\", VLOOKUP(K51,Projekte!C:D,2,FALSE))","v":""}]
[null,null,null,"","",null,"","","","",null,null,null,"","","",{"$f":"IF(K52=\"\", \"\", VLOOKUP(K52,Projekte!C:D,2,FALSE))","v":""}]
[null,null,null,"","",null,"","","","",null,null,null,"","","",{"$f":"IF(K53=\"\", \"\", VLOOKUP(K53,Projekte!C:D,2,FALSE))","v":""}]
[null,null,null,"","",null,"","","","",null,null,null,"","","",{"$f":"IF(K54=\"\", \"\", VLOOKUP(K54,Projekte!C:D,2,FALSE))","v":""}]
[null,null,null,"","",null,"","","","",null,null,null,"","","",{"$f":"IF(K55=\"\", \"\", VLOOKUP(K55,Projekte!C:D,2,FALSE))","v":""}]
[null,null,null,"","",null,"","","","",null,null,null,"","","",{"$f":"IF(K56=\"\", \"\", VLOOKUP(K56,Projekte!C:D,2,FALSE))","v":""}]
[null,null,null,"","",null,"","","","",null,null,null,"","","",{"$f":"IF(K57=\"\", \"\", VLOOKUP(K57,Projekte!C:D,2,FALSE))","v":""}]
[null,null,null,"","",null,"","","","",null,null,null,"","","",{"$f":"IF(K58=\"\", \"\", VLOOKUP(K58,Projekte!C:D,2,FALSE))","v":""}]
[null,null,null,"","",null,"","","","",null,null,null,"","","",{"$f":"IF(K59=\"\", \"\", VLOOKUP(K59,Projekte!C:D,2,FALSE))","v":""}]
[null,null,null,"","",null,"","","","",null,null,null,"","","",{"$f":"IF(K60=\"\", \"\", VLOOKUP(K60,Projekte!C:D,2,FALSE))","v":""}]
[null,null,null,"","",null,"","","","",null,null,null,"","","",{"$f":"IF(K61=\"\", \"\", VLOOKUP(K61,Projekte!C:D,2,FALSE))","v":""}]
[null,null,null,"","",null,"","","","",null,null,null,"","","",{"$f":"IF(K62=\"\", \"\", VLOOKUP(K62,Projekte!C:D,2,FALSE))","v":""}]
[null,null,null,"","",null,"","","","",null,null,null,"","","",{"$f":"IF(K63=\"\", \"\", VLOOKUP(K63,Projekte!C:D,2,FALSE))","v":""}]
[null,null,null,"","",null,"","","","",null,null,null,"","","",{"$f":"IF(K64=\"\", \"\", VLOOKUP(K64,Projekte!C:D,2,FALSE))","v":""}]
[null,null,null,"","",null,"","","","",null,null,null,"","","",{"$f":"IF(K65=\"\", \"\", VLOOKUP(K65,Projekte!C:D,2,FALSE))","v":""}]
[null,null,null,"","",null,"","","","",null,null,null,"","","",{"$f":"IF(K66=\"\", \"\", VLOOKUP(K66,Projekte!C:D,2,FALSE))","v":""}]
[null,null,null,"","",null,"","","","",null,null,null,"","","",{"$f":"IF(K67=\"\", \"\", VLOOKUP(K67,Projekte!C:D,2,FALSE))","v":""}]
[null,null,null,{"$f":"IF(C68=\"\", \"\", C68-B68)","v":""},{"$f":"IF(D68=\"\", \"\", (C68-B68)*24)","v":""},null,{"$f":"IF(K68 = selectThisProjekt,E68, \"\")","v":""},"","","",null,null,null,"","","",{"$f":"IF(K68=\"\", \"\", VLOOKUP(K68,Projekte!C:D,2,FALSE))","v":""}]
[null,null,null,"","",null,"",{"$f":"IF(F69 = \"\", G69, \"\")","v":""},{"$f":"IF(LOWER(F69) = \"r\",G69,\"\")","v":""},{"$f":"IF(AND(F69<>\"\", LOWER(F69) <> \"r\"),G69,\"\")","v":""},null,null,null,"","","",{"$f":"IF(K69=\"\", \"\", VLOOKUP(K69,Projekte!C:D,2,FALSE))","v":""}]
[null,null,null,"","",null,"","","","",null,null,null,{"$f":"IF(M70<>\"\", \"\", IF(F70 = \"\", G70, \"\"))","v":""},{"$f":"IF(M70<>\"\", \"\", IF(LOWER(F70) = \"r\",G70,\"\"))","v":""},{"$f":"IF(M70<>\"\", \"\", IF(AND(F70<>\"\", LOWER(F70) <> \"r\"),G70,\"\"))","v":""},{"$f":"IF(K70=\"\", \"\", VLOOKUP(K70,Projekte!C:D,2,FALSE))","v":""}]
[null,null,null,"","",null,"","","","",null,null,null,"","","",{"$f":"IF(K71=\"\", \"\", VLOOKUP(K71,Projekte!C:D,2,FALSE))","v":""}]
[null,null,null,"","",null,"","","","",null,null,null,"","","",{"$f":"IF(K72=\"\", \"\", VLOOKUP(K72,Projekte!C:D,2,FALSE))","v":""}]
[null,null,null,"","",null,"","","","",null,null,null,"","","",{"$f":"IF(K73=\"\", \"\", VLOOKUP(K73,Projekte!C:D,2,FALSE))","v":""}]
[null,null,null,"","",null,"","","","",null,null,null,"","","",{"$f":"IF(K74=\"\", \"\", VLOOKUP(K74,Projekte!C:D,2,FALSE))","v":""}]
[null,null,null,"","",null,"","","","",null,null,null,"","","",{"$f":"IF(K75=\"\", \"\", VLOOKUP(K75,Projekte!C:D,2,FALSE))","v":""}]
[null,null,null,"","",null,"","","","",null,null,null,"","","",{"$f":"IF(K76=\"\", \"\", VLOOKUP(K76,Projekte!C:D,2,FALSE))","v":""}]
[null,null,null,"","",null,"","","","",null,null,null,"","","",{"$f":"IF(K77=\"\", \"\", VLOOKUP(K77,Projekte!C:D,2,FALSE))","v":""}]
[null,null,null,"","",null,"","","","",null,null,null,"","","",{"$f":"IF(K78=\"\", \"\", VLOOKUP(K78,Projekte!C:D,2,FALSE))","v":""}]
[null,null,null,"","",null,"","","","",null,null,null,"","","",{"$f":"IF(K79=\"\", \"\", VLOOKUP(K79,Projekte!C:D,2,FALSE))","v":""}]
[null,null,null,"","",null,"","","","",null,null,null,"","","",{"$f":"IF(K80=\"\", \"\", VLOOKUP(K80,Projekte!C:D,2,FALSE))","v":""}]
[null,null,null,"","",null,"","","","",null,null,null,"","","",{"$f":"IF(K81=\"\", \"\", VLOOKUP(K81,Projekte!C:D,2,FALSE))","v":""}]
[null,null,null,"","",null,"","","","",null,null,null,"","","",{"$f":"IF(K82=\"\", \"\", VLOOKUP(K82,Projekte!C:D,2,FALSE))","v":""}]
[null,null,null,"","",null,"","","","",null,null,null,"","","",{"$f":"IF(K83=\"\", \"\", VLOOKUP(K83,Projekte!C:D,2,FALSE))","v":""}]
[null,null,null,"","",null,"","","","",null,null,null,"","","",{"$f":"IF(K84=\"\", \"\", VLOOKUP(K84,Projekte!C:D,2,FALSE))","v":""}]
[null,null,null,"","",null,"","","","",null,null,null,"","","",{"$f":"IF(K85=\"\", \"\", VLOOKUP(K85,Projekte!C:D,2,FALSE))","v":""}]
[null,null,null,"","",null,"","","","",null,null,null,"","","",{"$f":"IF(K86=\"\", \"\", VLOOKUP(K86,Projekte!C:D,2,FALSE))","v":""}]
[null,null,null,"","",null,"","","","",null,null,null,"","","",{"$f":"IF(K87=\"\", \"\", VLOOKUP(K87,Projekte!C:D,2,FALSE))","v":""}]
[null,null,null,"","",null,"","","","",null,null,null,"","","",{"$f":"IF(K88=\"\", \"\", VLOOKUP(K88,Projekte!C:D,2,FALSE))","v":""}]
[null,null,null,"","",null,"","","","",null,null,null,"","","",{"$f":"IF(K89=\"\", \"\", VLOOKUP(K89,Projekte!C:D,2,FALSE))","v":""}]
[null,null,null,"","",null,"","","","",null,null,null,"","","",{"$f":"IF(K90=\"\", \"\", VLOOKUP(K90,Projekte!C:D,2,FALSE))","v":""}]
[null,null,null,"","",null,"","","","",null,null,null,"","","",{"$f":"IF(K91=\"\", \"\", VLOOKUP(K91,Projekte!C:D,2,FALSE))","v":""}]
[null,null,null,"","",null,"","","","",null,null,null,"","","",{"$f":"IF(K92=\"\", \"\", VLOOKUP(K92,Projekte!C:D,2,FALSE))","v":""}]
[null,null,null,"","",null,"","","","",null,null,null,"","","",{"$f":"IF(K93=\"\", \"\", VLOOKUP(K93,Projekte!C:D,2,FALSE))","v":""}]
[null,null,null,"","",null,"","","","",null,null,null,"","","",{"$f":"IF(K94=\"\", \"\", VLOOKUP(K94,Projekte!C:D,2,FALSE))","v":""}]
[null,null,null,"","",null,"","","","",null,null,null,"","","",{"$f":"IF(K95=\"\", \"\", VLOOKUP(K95,Projekte!C:D,2,FALSE))","v":""}]
[null,null,null,"","",null,"","","","",null,null,null,"","","",{"$f":"IF(K96=\"\", \"\", VLOOKUP(K96,Projekte!C:D,2,FALSE))","v":""}]
[null,null,null,"","",null,"","","","",null,null,null,"","","",{"$f":"IF(K97=\"\", \"\", VLOOKUP(K97,Projekte!C:D,2,FALSE))","v":""}]
[null,null,null,"","",null,"","","","",null,null,null,"","","",{"$f":"IF(K98=\"\", \"\", VLOOKUP(K98,Projekte!C:D,2,FALSE))","v":""}]
[null,null,null,"","",null,"","","","",null,null,null,"","","",{"$f":"IF(K99=\"\", \"\", VLOOKUP(K99,Projekte!C:D,2,FALSE))","v":""}]
[null,null,null,"","",null,{"$f":"IF(K100 = selectThisProjekt,E100, \"\")","v":""},"","","",null,null,null,"","","",{"$f":"IF(K100=\"\", \"\", VLOOKUP(K100,Projekte!C:D,2,FALSE))","v":""}]
[null,null,null,"","",null,"","","","",null,null,null,"","","",{"$f":"IF(K101=\"\", \"\", VLOOKUP(K101,Projekte!C:D,2,FALSE))","v":""}]
[null,null,null,"","",null,"","","","",null,null,null,"","","",{"$f":"IF(K102=\"\", \"\", VLOOKUP(K102,Projekte!C:D,2,FALSE))","v":""}]
[null,null,null,"","",null,"","","","",null,null,null,"","","",{"$f":"IF(K103=\"\", \"\", VLOOKUP(K103,Projekte!C:D,2,FALSE))","v":""}]
[null,null,null,"","",null,"","","","",null,null,null,"","","",{"$f":"IF(K104=\"\", \"\", VLOOKUP(K104,Projekte!C:D,2,FALSE))","v":""}]
[null,null,null,"","",null,"","","","",null,null,null,"","","",{"$f":"IF(K105=\"\", \"\", VLOOKUP(K105,Projekte!C:D,2,FALSE))","v":""}]
[null,null,null,"","",null,"","","","",null,null,null,"","","",{"$f":"IF(K106=\"\", \"\", VLOOKUP(K106,Projekte!C:D,2,FALSE))","v":""}]
[null,null,null,"","",null,"","","","",null,null,null,"","","",{"$f":"IF(K107=\"\", \"\", VLOOKUP(K107,Projekte!C:D,2,FALSE))","v":""}]
[null,null,null,"","",null,"","","","",null,null,null,"","","",{"$f":"IF(K108=\"\", \"\", VLOOKUP(K108,Projekte!C:D,2,FALSE))","v":""}]
[null,null,null,"","",null,"","","","",null,null,null,"","","",{"$f":"IF(K109=\"\", \"\", VLOOKUP(K109,Projekte!C:D,2,FALSE))","v":""}]
[null,null,null,"","",null,"","","","",null,null,null,"","","",{"$f":"IF(K110=\"\", \"\", VLOOKUP(K110,Projekte!C:D,2,FALSE))","v":""}]
[null,null,null,"","",null,"","","","",null,null,null,"","","",{"$f":"IF(K111=\"\", \"\", VLOOKUP(K111,Projekte!C:D,2,FALSE))","v":""}]
[null,null,null,"","",null,"","","","",null,null,null,"","","",{"$f":"IF(K112=\"\", \"\", VLOOKUP(K112,Projekte!C:D,2,FALSE))","v":""}]
[null,null,null,"","",null,"","","","",null,null,null,"","","",{"$f":"IF(K113=\"\", \"\", VLOOKUP(K113,Projekte!C:D,2,FALSE))","v":""}]
[null,null,null,"","",null,"","","","",null,null,null,"","","",{"$f":"IF(K114=\"\", \"\", VLOOKUP(K114,Projekte!C:D,2,FALSE))","v":""}]
[null,null,null,"","",null,"","","","",null,null,null,"","","",{"$f":"IF(K115=\"\", \"\", VLOOKUP(K115,Projekte!C:D,2,FALSE))","v":""}]
[null,null,null,"","",null,"","","","",null,null,null,"","","",{"$f":"IF(K116=\"\", \"\", VLOOKUP(K116,Projekte!C:D,2,FALSE))","v":""}]
[null,null,null,"","",null,"","","","",null,null,null,"","","",{"$f":"IF(K117=\"\", \"\", VLOOKUP(K117,Projekte!C:D,2,FALSE))","v":""}]
[null,null,null,"","",null,"","","","",null,null,null,"","","",{"$f":"IF(K118=\"\", \"\", VLOOKUP(K118,Projekte!C:D,2,FALSE))","v":""}]
[null,null,null,"","",null,"","","","",null,null,null,"","","",{"$f":"IF(K119=\"\", \"\", VLOOKUP(K119,Projekte!C:D,2,FALSE))","v":""}]
[null,null,null,"","",null,"","","","",null,null,null,"","","",{"$f":"IF(K120=\"\", \"\", VLOOKUP(K120,Projekte!C:D,2,FALSE))","v":""}]
[null,null,null,"","",null,"","","","",null,null,null,"","","",{"$f":"IF(K121=\"\", \"\", VLOOKUP(K121,Projekte!C:D,2,FALSE))","v":""}]
[null,null,null,"","",null,"","","","",null,null,null,"","","",{"$f":"IF(K122=\"\", \"\", VLOOKUP(K122,Projekte!C:D,2,FALSE))","v":""}]
[null,null,null,"","",null,{"$f":"IF(K123 = selectThisProjekt,E123, \"\")","v":""},"","","",null,null,null,"","","",{"$f":"IF(K123=\"\", \"\", VLOOKUP(K123,Projekte!C:D,2,FALSE))","v":""}]
[null,null,null,"","",null,"","","","",null,null,null,"","","",{"$f":"IF(K124=\"\", \"\", VLOOKUP(K124,Projekte!C:D,2,FALSE))","v":""}]
[null,null,null,"","",null,{"$f":"IF(K125 = selectThisProjekt,E125, \"\")","v":""},"","","",null,null,null,"","","",{"$f":"IF(K125=\"\", \"\", VLOOKUP(K125,Projekte!C:D,2,FALSE))","v":""}]
[null,null,null,"","",null,"","","","",null,null,null,"","","",{"$f":"IF(K126=\"\", \"\", VLOOKUP(K126,Projekte!C:D,2,FALSE))","v":""}]
[null,null,null,"","",null,"","","","",null,null,null,"","","",{"$f":"IF(K127=\"\", \"\", VLOOKUP(K127,Projekte!C:D,2,FALSE))","v":""}]
[null,null,null,"","",null,"","","","",null,null,null,"","","",{"$f":"IF(K128=\"\", \"\", VLOOKUP(K128,Projekte!C:D,2,FALSE))","v":""}]
[null,null,null,"","",null,"","","","",null,null,null,"","","",{"$f":"IF(K129=\"\", \"\", VLOOKUP(K129,Projekte!C:D,2,FALSE))","v":""}]
[null,null,null,"","",null,"","","","",null,null,null,"","","",{"$f":"IF(K130=\"\", \"\", VLOOKUP(K130,Projekte!C:D,2,FALSE))","v":""}]
[null,null,null,"","",null,"","","","",null,null,null,"","","",{"$f":"IF(K131=\"\", \"\", VLOOKUP(K131,Projekte!C:D,2,FALSE))","v":""}]
[null,null,null,{"$f":"IF(C132=\"\", \"\", C132-B132)","v":""},{"$f":"IF(D132=\"\", \"\", (C132-B132)*24)","v":""},null,{"$f":"IF(K132 = selectThisProjekt,E132, \"\")","v":""},"","","",null,null,null,"","","",{"$f":"IF(K132=\"\", \"\", VLOOKUP(K132,Projekte!C:D,2,FALSE))","v":""}]
[null,null,null,"","",null,"",{"$f":"IF(F133 = \"\", G133, \"\")","v":""},{"$f":"IF(LOWER(F133) = \"r\",G133,\"\")","v":""},{"$f":"IF(AND(F133<>\"\", LOWER(F133) <> \"r\"),G133,\"\")","v":""},null,null,null,"","","",{"$f":"IF(K133=\"\", \"\", VLOOKUP(K133,Projekte!C:D,2,FALSE))","v":""}]
[null,null,null,"","",null,"","","","",null,null,null,{"$f":"IF(M134<>\"\", \"\", IF(F134 = \"\", G134, \"\"))","v":""},{"$f":"IF(M134<>\"\", \"\", IF(LOWER(F134) = \"r\",G134,\"\"))","v":""},{"$f":"IF(M134<>\"\", \"\", IF(AND(F134<>\"\", LOWER(F134) <> \"r\"),G134,\"\"))","v":""},{"$f":"IF(K134=\"\", \"\", VLOOKUP(K134,Projekte!C:D,2,FALSE))","v":""}]
[null,null,null,"","",null,"","","","",null,null,null,"","","",{"$f":"IF(K135=\"\", \"\", VLOOKUP(K135,Projekte!C:D,2,FALSE))","v":""}]
[null,null,null,"","",null,"","","","",null,null,null,"","","",{"$f":"IF(K136=\"\", \"\", VLOOKUP(K136,Projekte!C:D,2,FALSE))","v":""}]
[null,null,null,"","",null,"","","","",null,null,null,"","","",{"$f":"IF(K137=\"\", \"\", VLOOKUP(K137,Projekte!C:D,2,FALSE))","v":""}]
[null,null,null,"","",null,"","","","",null,null,null,"","","",{"$f":"IF(K138=\"\", \"\", VLOOKUP(K138,Projekte!C:D,2,FALSE))","v":""}]
[null,null,null,"","",null,"","","","",null,null,null,"","","",{"$f":"IF(K139=\"\", \"\", VLOOKUP(K139,Projekte!C:D,2,FALSE))","v":""}]
[null,null,null,"","",null,"","","","",null,null,null,"","","",{"$f":"IF(K140=\"\", \"\", VLOOKUP(K140,Projekte!C:D,2,FALSE))","v":""}]
[null,null,null,"","",null,"","","","",null,null,null,"","","",{"$f":"IF(K141=\"\", \"\", VLOOKUP(K141,Projekte!C:D,2,FALSE))","v":""}]
[null,null,null,"","",null,"","","","",null,null,null,"","","",{"$f":"IF(K142=\"\", \"\", VLOOKUP(K142,Projekte!C:D,2,FALSE))","v":""}]
[null,null,null,"","",null,"","","","",null,null,null,"","","",{"$f":"IF(K143=\"\", \"\", VLOOKUP(K143,Projekte!C:D,2,FALSE))","v":""}]
[null,null,null,"","",null,"","","","",null,null,null,"","","",{"$f":"IF(K144=\"\", \"\", VLOOKUP(K144,Projekte!C:D,2,FALSE))","v":""}]
[null,null,null,"","",null,"","","","",null,null,null,"","","",{"$f":"IF(K145=\"\", \"\", VLOOKUP(K145,Projekte!C:D,2,FALSE))","v":""}]
[null,null,null,"","",null,"","","","",null,null,null,"","","",{"$f":"IF(K146=\"\", \"\", VLOOKUP(K146,Projekte!C:D,2,FALSE))","v":""}]
[null,null,null,"","",null,"","","","",null,null,null,"","","",{"$f":"IF(K147=\"\", \"\", VLOOKUP(K147,Projekte!C:D,2,FALSE))","v":""}]
[null,null,null,"","",null,"","","","",null,null,null,"","","",{"$f":"IF(K148=\"\", \"\", VLOOKUP(K148,Projekte!C:D,2,FALSE))","v":""}]
[null,null,null,"","",null,"","","","",null,null,null,"","","",{"$f":"IF(K149=\"\", \"\", VLOOKUP(K149,Projekte!C:D,2,FALSE))","v":""}]
[null,null,null,"","",null,"","","","",null,null,null,"","","",{"$f":"IF(K150=\"\", \"\", VLOOKUP(K150,Projekte!C:D,2,FALSE))","v":""}]
[null,null,null,"","",null,"","","","",null,null,null,"","","",{"$f":"IF(K151=\"\", \"\", VLOOKUP(K151,Projekte!C:D,2,FALSE))","v":""}]
[null,null,null,"","",null,"","","","",null,null,null,"","","",{"$f":"IF(K152=\"\", \"\", VLOOKUP(K152,Projekte!C:D,2,FALSE))","v":""}]
[null,null,null,"","",null,"","","","",null,null,null,"","","",{"$f":"IF(K153=\"\", \"\", VLOOKUP(K153,Projekte!C:D,2,FALSE))","v":""}]
[null,null,null,"","",null,"","","","",null,null,null,"","","",{"$f":"IF(K154=\"\", \"\", VLOOKUP(K154,Projekte!C:D,2,FALSE))","v":""}]
[null,null,null,"","",null,"","","","",null,null,null,"","","",{"$f":"IF(K155=\"\", \"\", VLOOKUP(K155,Projekte!C:D,2,FALSE))","v":""}]
[null,null,null,"","",null,"","","","",null,null,null,"","","",{"$f":"IF(K156=\"\", \"\", VLOOKUP(K156,Projekte!C:D,2,FALSE))","v":""}]
[null,null,null,"","",null,"","","","",null,null,null,"","","",{"$f":"IF(K157=\"\", \"\", VLOOKUP(K157,Projekte!C:D,2,FALSE))","v":""}]
[null,null,null,"","",null,"","","","",null,null,null,"","","",{"$f":"IF(K158=\"\", \"\", VLOOKUP(K158,Projekte!C:D,2,FALSE))","v":""}]
[null,null,null,"","",null,"","","","",null,null,null,"","","",{"$f":"IF(K159=\"\", \"\", VLOOKUP(K159,Projekte!C:D,2,FALSE))","v":""}]
[null,null,null,"","",null,"","","","",null,null,null,"","","",{"$f":"IF(K160=\"\", \"\", VLOOKUP(K160,Projekte!C:D,2,FALSE))","v":""}]
[null,null,null,"","",null,"","","","",null,null,null,"","","",{"$f":"IF(K161=\"\", \"\", VLOOKUP(K161,Projekte!C:D,2,FALSE))","v":""}]
[null,null,null,"","",null,"","","","",null,null,null,"","","",{"$f":"IF(K162=\"\", \"\", VLOOKUP(K162,Projekte!C:D,2,FALSE))","v":""}]
[null,null,null,"","",null,"","","","",null,null,null,"","","",{"$f":"IF(K163=\"\", \"\", VLOOKUP(K163,Projekte!C:D,2,FALSE))","v":""}]
[null,null,null,"","",null,{"$f":"IF(K164 = selectThisProjekt,E164, \"\")","v":""},"","","",null,null,null,"","","",{"$f":"IF(K164=\"\", \"\", VLOOKUP(K164,Projekte!C:D,2,FALSE))","v":""}]
[null,null,null,"","",null,"","","","",null,null,null,"","","",{"$f":"IF(K165=\"\", \"\", VLOOKUP(K165,Projekte!C:D,2,FALSE))","v":""}]
[null,null,null,"","",null,"","","","",null,null,null,"","","",{"$f":"IF(K166=\"\", \"\", VLOOKUP(K166,Projekte!C:D,2,FALSE))","v":""}]
[null,null,null,"","",null,"","","","",null,null,null,"","","",{"$f":"IF(K167=\"\", \"\", VLOOKUP(K167,Projekte!C:D,2,FALSE))","v":""}]
[null,null,null,"","",null,"","","","",null,null,null,"","","",{"$f":"IF(K168=\"\", \"\", VLOOKUP(K168,Projekte!C:D,2,FALSE))","v":""}]
[null,null,null,"","",null,"","","","",null,null,null,"","","",{"$f":"IF(K169=\"\", \"\", VLOOKUP(K169,Projekte!C:D,2,FALSE))","v":""}]
[null,null,null,"","",null,{"$f":"IF(K170 = selectThisProjekt,E170, \"\")","v":""},"","","",null,null,null,"","","",{"$f":"IF(K170=\"\", \"\", VLOOKUP(K170,Projekte!C:D,2,FALSE))","v":""}]
[null,null,null,"","",null,"","","","",null,null,null,"","","",{"$f":"IF(K171=\"\", \"\", VLOOKUP(K171,Projekte!C:D,2,FALSE))","v":""}]
[null,null,null,"","",null,"","","","",null,null,null,"","","",{"$f":"IF(K172=\"\", \"\", VLOOKUP(K172,Projekte!C:D,2,FALSE))","v":""}]
[null,null,null,"","",null,"","","","",null,null,null,"","","",{"$f":"IF(K173=\"\", \"\", VLOOKUP(K173,Projekte!C:D,2,FALSE))","v":""}]
[null,null,null,"","",null,"","","","",null,null,null,"","","",{"$f":"IF(K174=\"\", \"\", VLOOKUP(K174,Projekte!C:D,2,FALSE))","v":""}]
[null,null,null,"","",null,"","","","",null,null,null,"","","",{"$f":"IF(K175=\"\", \"\", VLOOKUP(K175,Projekte!C:D,2,FALSE))","v":""}]
[null,null,null,"","",null,"","","","",null,null,null,"","","",{"$f":"IF(K176=\"\", \"\", VLOOKUP(K176,Projekte!C:D,2,FALSE))","v":""}]
[null,null,null,"","",null,"","","","",null,null,null,"","","",{"$f":"IF(K177=\"\", \"\", VLOOKUP(K177,Projekte!C:D,2,FALSE))","v":""}]
[null,null,null,"","",null,"","","","",null,null,null,"","","",{"$f":"IF(K178=\"\", \"\", VLOOKUP(K178,Projekte!C:D,2,FALSE))","v":""}]
[null,null,null,"","",null,"","","","",null,null,null,"","","",{"$f":"IF(K179=\"\", \"\", VLOOKUP(K179,Projekte!C:D,2,FALSE))","v":""}]
[null,null,null,"","",null,"","","","",null,null,null,"","","",{"$f":"IF(K180=\"\", \"\", VLOOKUP(K180,Projekte!C:D,2,FALSE))","v":""}]
[null,null,null,"","",null,"","","","",null,null,null,"","","",{"$f":"IF(K181=\"\", \"\", VLOOKUP(K181,Projekte!C:D,2,FALSE))","v":""}]
[null,null,null,"","",null,"","","","",null,null,null,"","","",{"$f":"IF(K182=\"\", \"\", VLOOKUP(K182,Projekte!C:D,2,FALSE))","v":""}]
[null,null,null,"","",null,"","","","",null,null,null,"","","",{"$f":"IF(K183=\"\", \"\", VLOOKUP(K183,Projekte!C:D,2,FALSE))","v":""}]
[null,null,null,"","",null,"","","","",null,null,null,"","","",{"$f":"IF(K184=\"\", \"\", VLOOKUP(K184,Projekte!C:D,2,FALSE))","v":""}]
[null,null,null,"","",null,"","","","",null,null,null,"","","",{"$f":"IF(K185=\"\", \"\", VLOOKUP(K185,Projekte!C:D,2,FALSE))","v":""}]
[null,null,null,"","",null,"","","","",null,null,null,"","","",{"$f":"IF(K186=\"\", \"\", VLOOKUP(K186,Projekte!C:D,2,FALSE))","v":""}]
[null,null,null,"","",null,"","","","",null,null,null,"","","",{"$f":"IF(K187=\"\", \"\", VLOOKUP(K187,Projekte!C:D,2,FALSE))","v":""}]
[null,null,null,"","",null,"","","","",null,null,null,"","","",{"$f":"IF(K188=\"\", \"\", VLOOKUP(K188,Projekte!C:D,2,FALSE))","v":""}]
[null,null,null,"","",null,"","","","",null,null,null,"","","",{"$f":"IF(K189=\"\", \"\", VLOOKUP(K189,Projekte!C:D,2,FALSE))","v":""}]
[null,null,null,"","",null,"","","","",null,null,null,"","","",{"$f":"IF(K190=\"\", \"\", VLOOKUP(K190,Projekte!C:D,2,FALSE))","v":""}]
[null,null,null,"","",null,"","","","",null,null,null,"","","",{"$f":"IF(K191=\"\", \"\", VLOOKUP(K191,Projekte!C:D,2,FALSE))","v":""}]
[null,null,null,"","",null,"","","","",null,null,null,"","","",{"$f":"IF(K192=\"\", \"\", VLOOKUP(K192,Projekte!C:D,2,FALSE))","v":""}]
[null,null,null,"","",null,"","","","",null,null,null,"","","",{"$f":"IF(K193=\"\", \"\", VLOOKUP(K193,Projekte!C:D,2,FALSE))","v":""}]
[null,null,null,"","",null,"","","","",null,null,null,"","","",{"$f":"IF(K194=\"\", \"\", VLOOKUP(K194,Projekte!C:D,2,FALSE))","v":""}]
[null,null,null,"","",null,"","","","",null,null,null,"","","",{"$f":"IF(K195=\"\", \"\", VLOOKUP(K195,Projekte!C:D,2,FALSE))","v":""}]
[null,null,null,"","",null,"","","","",null,null,null,"","","",{"$f":"IF(K196=\"\", \"\", VLOOKUP(K196,Projekte!C:D,2,FALSE))","v":""}]
[null,null,null,"","",null,"","","","",null,null,null,"","","",{"$f":"IF(K197=\"\", \"\", VLOOKUP(K197,Projekte!C:D,2,FALSE))","v":""}]
[null,null,null,"","",null,"","","","",null,null,null,{"$f":"IF(M198<>\"\", \"\", IF(F198 = \"\", G198, \"\"))","v":""},{"$f":"IF(M198<>\"\", \"\", IF(LOWER(F198) = \"r\",G198,\"\"))","v":""},{"$f":"IF(M198<>\"\", \"\", IF(AND(F198<>\"\", LOWER(F198) <> \"r\"),G198,\"\"))","v":""},{"$f":"IF(K198=\"\", \"\", VLOOKUP(K198,Projekte!C:D,2,FALSE))","v":""}]
[null,null,null,"","",null,"","","","",null,null,null,"","","",{"$f":"IF(K199=\"\", \"\", VLOOKUP(K199,Projekte!C:D,2,FALSE))","v":""}]
[null,null,null,"","",null,"","","","",null,null,null,"","","",{"$f":"IF(K200=\"\", \"\", VLOOKUP(K200,Projekte!C:D,2,FALSE))","v":""}]
[null,null,null,"","",null,"","","","",null,null,null,"","","",{"$f":"IF(K201=\"\", \"\", VLOOKUP(K201,Projekte!C:D,2,FALSE))","v":""}]
[null,null,null,"","",null,"","","","",null,null,null,"","","",{"$f":"IF(K202=\"\", \"\", VLOOKUP(K202,Projekte!C:D,2,FALSE))","v":""}]
[null,null,null,"","",null,{"$f":"IF(K203 = selectThisProjekt,E203, \"\")","v":""},"","","",null,null,null,"","","",{"$f":"IF(K203=\"\", \"\", VLOOKUP(K203,Projekte!C:D,2,FALSE))","v":""}]
[null,null,null,"<Ende Formeln>"]

{"sheet":"Hilfe","index":13,"n_rows":3,"n_cols":4,"rows_kept":3,"cut":false,"hidden":false,"merged":[]}
[]
[null,"Anleitung"]
[null,null,null,"https://wissen.braucke.net/Help/Excel_Projektzeiten"]